{"text_format":"1","workbook":"xlsx","n_sheets":7,"sheets":["Cadastro","CARACTERIZAÇÃO","SCS - Dispersão","HRB_SUCS","HRB_SUCS(Dados)","TABELAS","CALCULOS"],"not_rendered":{"charts":5,"images":5,"macros":1,"external_links":4,"defined_names":5,"comments":0,"pivot_tables":0},"unopened":[],"bounds":{"document_bytes":16777216,"sheet_cells":100000,"rows_first":2000,"rows_last":500,"rows_between":2000,"halvings":0,"cell_chars":16384,"cell_head_chars":4096},"cells_cut":0,"cells_raw":0,"read":"whole","date_system":"1900"}

{"sheet":"Cadastro","index":0,"n_rows":113,"n_cols":9,"rows_kept":113,"cut":false,"hidden":true,"merged":[[11,2,11,4],[19,2,19,4],[21,2,23,4],[17,2,17,4],[18,2,18,4],[12,2,12,4],[13,2,13,4],[14,2,14,4],[15,2,15,4],[16,2,16,4],[5,6,5,8],[6,6,6,8],[7,6,7,8],[8,6,8,8],[10,2,10,4],[5,2,5,4],[6,2,6,4],[7,2,7,4],[8,2,8,4],[9,2,9,4]]}
[]
[]
[]
[]
[null,"Registro:","0565",null,null,null,"Cabeçalho"]
[null,"Cliente:",{"$f":"VLOOKUP(C5,'[1]Livro de Registro'!$A:$B,2,0)","v":"Prefeitura Municipal de Nova Lima"},null,null,null,"PREFEITURA MUNICIPAL DE NOVA LIMA"]
[null,"Projeto:","PROJETO DE PAVIMENTAÇÃO",null,null,null,"PROJETO DE INFRAESTRUTURA"]
[null,"Cód. Projeto:","BELAGIO",null,null,null,"ENSAIOS GEOTÉCNICOS DE LABORATÓRIO"]
[null,"N° cliente:","-",null,null,null,"RELATÓRIO TÉCNICO"]
[null,"N° contratada:","SND-PNL-030-RTE-04723-REVA"]
[null,"Revisão:","A"]
[null,"Obra:",{"$f":"VLOOKUP(C5,'[1]Livro de Registro'!$A:$C,3,0)","v":"Pavimentação"}]
[null,"Local:",{"$f":"VLOOKUP(C5,'[1]Livro de Registro'!$A:$D,4,0)","v":"Belagio"}]
[null,"Material:","Silte areno argiloso com pedregulho"]
[null,"Furo:",{"$f":"VLOOKUP(C5,'[1]Livro de Registro'!$A:$G,7,0)","v":"ST-02"}]
[null,"Profundidade (m):",{"$f":"VLOOKUP(C5,'[1]Livro de Registro'!$A:$I,9,0)","v":"0,15 a 0,60 m"}]
[null,"Coordenadas:",{"$f":"VLOOKUP(C5,'[1]Livro de Registro'!$A:$H,8,0)","v":0}]
[null,"Dia",17]
[null,"Mês","abril"]
[null,"Verificador:","DLFF"]
[null,null,{"$f":"CONCATENATE(\"Belo Horizonte, \",C18,\" de \", C19,\" de 2023.\")","v":"Belo Horizonte, 17 de abril de 2023."}]
[null,null,"Inserir logo cliente em todas as páginas."]
[]
[]
[]
[]
[]
[]
[]
[]
[]
[]
[]
[]
[]
[]
[]
[]
[]
[]
[]
[]
[]
[]
[]
[]
[]
[]
[]
[]
[]
[]
[]
[]
[]
[]
[]
[]
[]
[]
[]
[]
[]
[]
[]
[]
[]
[]
[]
[]
[]
[]
[]
[]
[]
[]
[]
[]
[]
[]
[]
[]
[]
[]
[]
[]
[]
[]
[]
[]
[]
[]
[]
[]
[]
[]
[]
[]
[]
[]
[]
[]
[]
[]
[]
[]
[]
["CLIENTE: ",null,{"$f":"IF(C5=\"\",\"\",VLOOKUP($C$5,'[2]Livro de Registro'!$A$1:$I$8000,2))","v":"Prefeitura Municipal de Governador Valadares/MG"}]
["PROJETO/OBRA:    ",null,{"$f":"IF(C5=\"\",\"\",VLOOKUP($C$5,'[2]Livro de Registro'!$A$1:$I$8000,3))","v":"Rua Dois, S/Nº - Bairro Planalto"},null,null,"FURO/AM.:",null,null,{"$f":"IF(C5=\"\",\"\",VLOOKUP($C$5,'[2]Livro de Registro'!$A$1:$I$8000,7))","v":"04"}]
["TRECHO:",null,{"$f":"IF(C5=\"\",\"\",VLOOKUP($C$5,'[2]Livro de Registro'!$A$1:$I$8000,4))","v":"A.R - 005"},null,null,"ESTACA: ",null,null,{"$f":"IF(C5=\"\",\"\",VLOOKUP($C$5,'[2]Livro de Registro'!$A$1:$I$8000,8))","v":0}]
["SUB-TRECHO :  ",null,{"$f":"IF(C5=\"\",\"\",VLOOKUP($C$5,'[2]Livro de Registro'!$A$1:$I$8000,5))","v":0},null,null,"PROFUND.: ",null,null,{"$f":"IF(C5=\"\",\"\",VLOOKUP($C$5,'[2]Livro de Registro'!$A$1:$I$8000,9))","v":"0,00 - 2,00"}]
["ESTUDO  :   ",null,{"$f":"IF(C5=\"\",\"\",VLOOKUP($C$5,'[2]Livro de Registro'!$A$1:$M$8000,6))","v":"2º Talude"}]
["CLASS. MATERIAL:",null,{"$f":"IF(C6=\"\",\"\",VLOOKUP($C$5,'[2]Livro de Registro'!$A$1:$M$8000,12))","v":"Silte rosado"}]

{"sheet":"CARACTERIZAÇÃO","index":1,"n_rows":388,"n_cols":35,"rows_kept":388,"cut":false,"hidden":false,"merged":[[211,4,211,8],[122,1,122,7],[122,10,122,15],[180,16,180,18],[181,16,181,18],[182,4,182,18],[291,1,291,4],[176,7,176,9],[177,7,177,9],[177,4,177,6],[290,5,290,6],[290,15,290,16],[290,11,290,12],[289,11,289,12],[288,7,288,8],[289,7,289,8],[290,7,290,8],[288,1,288,4],[289,1,289,4],[290,1,290,4],[217,9,217,13],[185,2,185,16],[214,14,214,18],[286,13,286,14],[6,11,6,16],[8,11,8,16],[195,11,196,18],[179,4,179,6],[178,4,178,6],[176,4,176,6],[175,4,175,6],[187,9,187,16],[186,9,186,16],[188,2,188,8],[187,2,187,8],[186,2,186,8],[179,7,179,9],[180,7,180,9],[118,3,118,4],[117,3,117,4],[148,16,148,18],[149,16,149,18],[150,16,150,18],[151,16,151,18],[148,7,148,9],[117,17,117,18],[117,7,117,8],[117,9,117,10],[285,1,285,4],[286,1,286,4],[285,5,285,12],[278,8,278,12],[278,5,280,7],[258,11,259,18],[278,13,278,14],[279,13,279,14],[280,13,280,14],[277,17,277,18],[276,17,276,18],[280,17,280,18],[274,17,274,18],[284,1,284,4],[281,17,281,18],[281,15,281,16],[282,15,282,16],[284,13,284,18],[283,13,283,18],[282,13,282,14],[281,5,283,7],[282,17,282,18],[281,1,283,4],[281,8,281,12],[365,1,365,3],[364,1,364,3],[363,1,363,3],[362,1,362,3],[361,1,361,3],[364,4,364,6],[362,4,362,6],[360,4,360,6],[347,1,349,1],[347,2,347,4],[348,2,348,4],[351,2,351,4],[352,2,352,4],[354,2,354,4],[353,1,355,1],[353,2,353,4],[349,2,349,4],[350,1,352,1],[350,2,350,4],[360,1,360,3],[355,2,355,4],[287,1,287,4],[287,5,287,6],[322,1,322,18],[297,17,297,18],[290,17,290,18],[288,9,288,10],[290,9,290,10],[287,9,287,10],[287,13,287,14],[290,13,290,14],[289,13,289,14],[291,17,291,18],[288,5,288,6],[286,15,287,18],[288,13,288,14],[288,11,288,12],[291,15,291,16],[291,13,291,14],[291,9,291,10],[289,9,289,10],[291,11,291,12],[288,15,289,16],[286,9,286,10],[288,17,289,18],[287,11,287,12],[289,5,289,6],[286,11,286,12],[286,5,286,6],[113,9,114,10],[286,7,286,8],[287,7,287,8],[218,9,218,13],[149,7,149,9],[149,13,149,15],[150,13,150,15],[151,13,151,15],[152,13,152,15],[281,13,281,14],[153,13,153,15],[154,13,154,15],[175,10,175,12],[150,7,150,9],[151,7,151,9],[152,7,152,9],[153,7,153,9],[154,7,154,9],[270,2,270,9],[258,7,260,10],[105,4,105,7],[117,11,117,12],[117,13,117,14],[118,7,118,8],[118,9,118,10],[143,2,143,9],[142,2,142,9],[141,2,141,9],[130,1,130,18],[117,1,117,2],[118,13,118,14],[131,11,132,18],[108,1,108,3],[107,1,107,3],[109,9,109,13],[113,3,114,4],[116,3,116,4],[113,5,114,6],[110,1,110,3],[115,9,115,10],[115,11,115,12],[105,1,105,3],[110,9,110,13],[115,7,115,8],[104,4,104,7],[102,1,102,3],[77,2,77,9],[78,2,78,9],[81,17,81,18],[66,3,68,6],[101,4,101,7],[74,1,75,18],[100,4,100,7],[103,9,103,13],[72,17,72,18],[71,17,71,18],[70,17,70,18],[72,11,72,16],[105,14,105,18],[103,4,103,7],[49,11,49,12],[58,3,58,4],[51,5,51,6],[54,3,54,4],[51,1,51,2],[115,13,115,14],[113,13,114,14],[113,7,114,8],[106,1,106,3],[106,4,106,7],[115,17,116,18],[106,9,106,13],[104,9,104,13],[112,17,112,18],[113,17,114,18],[107,4,107,7],[116,5,116,6],[115,5,115,6],[110,4,110,8],[109,1,109,3],[104,1,104,3],[103,1,103,3],[100,1,100,3],[101,1,101,3],[71,11,71,16],[66,7,68,10],[57,3,57,4],[57,9,57,10],[56,9,56,10],[58,9,58,10],[50,3,50,4],[54,9,54,10],[51,11,51,12],[50,11,50,12],[56,3,56,4],[52,1,52,2],[66,11,67,18],[55,1,55,2],[54,1,54,2],[53,5,53,6],[53,3,53,4],[57,11,57,12],[56,11,56,12],[56,1,56,2],[79,2,79,9],[101,9,101,13],[40,49,40,53],[13,2,13,9],[21,1,21,2],[22,1,22,2],[23,1,23,2],[25,1,25,2],[26,1,26,2],[27,1,27,2],[24,1,24,2],[32,32,32,33],[33,32,33,33],[28,31,30,31],[28,32,28,33],[29,32,29,33],[30,32,30,33],[31,31,33,31],[31,32,31,33],[38,31,38,47],[39,15,39,16],[39,39,40,41],[39,42,40,44],[39,45,40,47],[34,31,36,31],[39,31,39,32],[119,21,119,22],[120,21,120,22],[118,21,118,22],[63,31,63,34],[63,38,63,40],[117,21,117,22],[41,39,41,41],[42,31,42,32],[45,33,45,35],[45,36,45,38],[64,31,64,32],[64,33,64,36],[47,32,55,46],[46,42,46,44],[46,45,46,47],[45,39,45,41],[45,42,45,44],[64,41,65,47],[39,33,40,35],[39,36,40,38],[41,36,41,38],[40,31,40,32],[34,32,34,33],[35,32,35,33],[36,32,36,33],[52,5,52,6],[36,9,37,10],[41,13,41,14],[34,9,35,16],[46,33,46,35],[51,13,51,15],[50,13,50,15],[46,5,46,6],[42,17,42,18],[41,17,41,18],[40,17,40,18],[39,17,39,18],[38,17,38,18],[41,15,41,16],[43,13,43,14],[40,13,40,14],[39,13,39,14],[46,36,46,38],[45,31,45,32],[121,21,121,22],[112,21,113,25],[114,21,114,22],[115,21,115,22],[116,21,116,22],[108,4,108,18],[76,2,76,9],[115,15,116,16],[113,15,114,16],[121,23,121,25],[107,14,107,18],[112,1,112,16],[103,14,103,18],[116,11,116,12],[100,9,100,13],[104,14,104,18],[113,1,114,1],[107,9,107,13],[113,2,114,2],[110,14,110,18],[111,1,111,18],[45,3,45,4],[105,9,105,13],[41,45,41,47],[63,41,63,42],[50,1,50,2],[51,3,51,4],[53,9,53,10],[52,9,52,10],[51,9,51,10],[50,9,50,10],[49,9,49,10],[50,5,50,6],[45,45,45,47],[45,13,45,15],[45,11,45,12],[43,7,43,8],[46,9,46,10],[41,42,41,44],[41,31,41,32],[41,33,41,35],[46,39,46,41],[62,38,62,40],[43,31,43,32],[44,31,44,32],[46,31,46,32],[58,11,58,12],[53,13,53,15],[52,13,52,15],[69,17,69,18],[55,3,55,4],[55,9,55,10],[54,7,54,8],[55,13,55,15],[54,13,54,15],[53,11,53,12],[53,7,53,8],[54,5,54,6],[52,11,52,12],[52,3,52,4],[68,11,68,18],[109,4,109,8],[116,9,116,10],[102,4,102,7],[54,11,54,12],[55,11,55,12],[48,11,48,12],[47,11,47,12],[46,11,46,12],[47,13,47,15],[46,13,46,15],[109,14,109,18],[100,14,100,18],[101,14,101,18],[62,13,62,14],[102,14,102,18],[102,9,102,13],[48,3,48,4],[106,14,106,18],[82,1,99,18],[80,6,80,12],[58,5,58,6],[47,1,47,2],[46,1,46,2],[58,7,58,8],[28,17,28,18],[27,17,27,18],[26,17,26,18],[25,17,25,18],[36,15,37,16],[31,15,31,16],[30,15,30,16],[29,15,29,16],[28,15,28,16],[27,15,27,16],[34,17,35,18],[32,9,33,18],[29,9,29,10],[36,17,37,18],[31,17,31,18],[30,17,30,18],[29,17,29,18],[31,13,31,14],[30,13,30,14],[29,13,29,14],[28,13,28,14],[26,11,26,12],[25,11,25,12],[31,11,31,12],[30,11,30,12],[29,11,29,12],[28,11,28,12],[27,13,27,14],[70,11,70,16],[69,11,69,16],[49,13,49,15],[44,15,44,16],[43,15,43,16],[48,13,48,15],[65,1,65,18],[27,3,27,4],[28,3,28,8],[30,1,31,8],[30,9,30,10],[28,9,28,10],[48,1,48,2],[29,1,29,6],[44,17,44,18],[43,17,43,18],[36,1,37,8],[58,1,58,2],[57,1,57,2],[57,7,57,8],[45,1,45,2],[46,7,46,8],[45,5,45,6],[47,5,47,6],[38,11,38,12],[36,13,37,14],[53,1,53,2],[42,15,42,16],[36,11,37,12],[43,11,43,12],[49,1,49,2],[41,11,41,12],[42,11,42,12],[47,3,47,4],[49,5,49,6],[48,5,48,6],[48,9,48,10],[47,9,47,10],[46,3,46,4],[49,3,49,4],[38,13,38,14],[40,15,40,16],[38,15,38,16],[139,1,140,18],[131,3,133,6],[151,10,151,12],[149,10,149,12],[149,4,149,6],[148,4,148,6],[148,10,148,12],[152,4,152,6],[137,11,137,16],[131,7,133,10],[151,4,151,6],[150,4,150,6],[147,1,147,18],[144,2,144,9],[150,10,150,12],[145,6,145,12],[148,13,148,15],[152,10,152,12],[152,16,152,18],[153,4,153,6],[154,4,154,6],[133,11,133,18],[181,10,181,12],[38,9,38,10],[42,13,42,14],[128,1,128,6],[121,8,121,18],[121,2,121,3],[137,17,137,18],[136,17,136,18],[135,17,135,18],[134,17,134,18],[121,6,121,7],[113,11,114,12],[57,5,57,6],[56,5,56,6],[55,5,55,6],[120,1,120,7],[120,8,120,18],[118,11,118,12],[134,11,134,16],[135,11,135,16],[136,11,136,16],[181,4,181,6],[180,4,180,6],[198,11,198,16],[198,17,198,18],[195,7,197,10],[188,9,188,16],[175,16,175,18],[176,16,176,18],[177,16,177,18],[178,16,178,18],[178,7,178,9],[181,7,181,9],[179,10,179,12],[180,10,180,12],[195,3,197,6],[183,4,183,18],[180,13,180,15],[181,13,181,15],[178,10,178,12],[197,11,197,18],[191,13,191,14],[179,16,179,18],[28,1,28,2],[19,9,20,18],[23,11,24,12],[26,9,26,10],[25,9,25,10],[23,9,24,10],[175,7,175,9],[42,7,42,8],[41,7,41,8],[40,7,40,8],[39,7,39,8],[38,7,38,8],[31,9,31,10],[56,7,56,8],[55,7,55,8],[81,9,81,10],[156,1,170,18],[174,1,174,18],[127,1,127,6],[115,3,115,4],[116,7,116,8],[121,4,121,5],[118,1,118,2],[155,4,155,6],[7,17,7,18],[6,17,6,18],[8,17,8,18],[18,17,18,18],[21,17,22,18],[23,17,24,18],[26,13,26,14],[27,11,27,12],[17,6,17,12],[21,9,22,16],[19,1,20,8],[21,3,21,4],[22,3,22,4],[21,5,21,6],[22,5,22,6],[23,5,23,6],[24,5,24,6],[25,5,25,6],[26,5,26,6],[27,5,27,6],[15,2,15,9],[14,2,14,9],[23,15,24,16],[24,7,24,8],[21,7,21,8],[23,7,23,8],[23,3,23,4],[24,3,24,4],[25,3,25,4],[26,3,26,4],[26,7,26,8],[25,7,25,8],[23,13,24,14],[25,13,25,14],[211,9,211,13],[211,14,211,18],[119,13,119,14],[117,5,119,6],[153,16,153,18],[154,16,154,18],[155,16,155,18],[155,13,155,15],[116,13,116,14],[175,13,175,15],[176,13,176,15],[177,13,177,15],[178,13,178,15],[210,9,210,10],[179,13,179,15],[153,10,153,12],[155,10,155,12],[201,11,201,16],[208,2,208,9],[205,2,205,9],[210,17,210,18],[206,2,206,9],[207,2,207,9],[127,13,127,14],[29,7,29,8],[26,15,26,16],[25,15,25,16],[200,17,200,18],[44,13,44,14],[44,11,44,12],[40,11,40,12],[39,11,39,12],[58,13,58,15],[57,13,57,15],[56,13,56,15],[44,9,44,10],[43,9,43,10],[42,9,42,10],[41,9,41,10],[40,9,40,10],[154,10,154,12],[155,7,155,9],[33,7,33,8],[27,9,27,10],[176,10,176,12],[177,10,177,12],[199,11,199,16],[200,11,200,16],[387,1,387,18],[323,7,325,10],[325,11,325,18],[326,11,326,16],[326,17,326,18],[327,11,327,16],[327,17,327,18],[328,11,328,16],[328,17,328,18],[329,11,329,16],[329,17,329,18],[331,1,332,18],[333,2,333,9],[334,2,334,9],[365,4,365,6],[365,7,365,9],[365,10,365,12],[365,13,365,15],[365,16,365,18],[363,4,363,6],[363,7,363,9],[363,10,363,12],[363,13,363,15],[323,3,325,6],[358,10,359,12],[358,13,359,15],[358,1,358,3],[359,1,359,3],[364,13,364,15],[361,4,361,6],[361,7,361,9],[361,10,361,12],[361,13,361,15],[360,13,360,15],[364,7,364,9],[364,10,364,12],[360,10,360,12],[296,5,296,6],[296,1,296,4],[295,1,295,4],[295,15,295,18],[297,9,297,10],[297,15,297,16],[297,13,297,14],[297,11,297,12],[297,7,297,8],[295,11,295,12],[295,9,295,10],[296,9,296,10],[295,7,295,8],[295,5,295,6],[297,5,297,6],[297,1,297,4],[296,7,296,8],[345,2,345,4],[362,7,362,9],[360,7,360,9],[35,7,35,8],[34,7,34,8],[44,7,44,8],[209,6,209,12],[260,11,260,18],[261,11,261,16],[262,11,262,16],[262,17,262,18],[261,17,261,18],[219,4,219,18],[218,4,218,8],[258,3,260,6],[201,17,201,18],[199,17,199,18],[218,14,218,18],[215,14,215,18],[277,13,277,14],[323,11,324,18],[282,8,282,12],[283,8,283,12],[284,5,284,12],[3,7,5,10],[359,20,359,24],[336,2,336,9],[357,1,357,18],[358,4,359,6],[358,7,359,9],[335,2,335,9],[358,16,359,18],[338,1,338,18],[339,1,340,1],[339,2,339,4],[340,2,340,4],[341,1,343,1],[341,2,341,4],[342,2,342,4],[343,2,343,4],[344,1,346,1],[344,2,344,4],[194,1,194,18],[257,1,257,18],[203,1,204,18],[263,11,263,16],[264,11,264,16],[346,2,346,4],[11,1,12,18],[3,3,5,6],[22,7,22,8],[27,7,27,8],[18,9,18,10],[39,9,39,10],[119,7,119,8],[119,9,119,10],[119,11,119,12],[119,1,119,2],[119,3,119,4],[3,11,4,18],[9,11,9,16],[7,11,7,16],[9,17,9,18],[47,7,47,8],[52,7,52,8],[48,7,48,8],[49,7,49,8],[50,7,50,8],[51,7,51,8],[45,7,45,8],[32,7,32,8],[5,11,5,18],[274,2,274,3],[278,1,280,4],[279,8,279,12],[280,8,280,12],[275,1,277,4],[275,5,277,7],[216,14,216,18],[217,14,217,18],[216,9,216,13],[266,1,267,18],[271,2,271,9],[268,2,268,9],[269,2,269,9],[217,4,217,8],[216,4,216,8],[212,9,212,13],[213,9,213,13],[264,17,264,18],[263,17,263,18],[215,4,215,8],[214,4,214,8],[212,14,212,18],[213,14,213,18],[214,9,214,13],[215,9,215,13],[254,13,254,14],[213,4,213,8],[212,4,212,8],[293,5,294,6],[293,1,294,4],[292,5,292,6],[292,1,292,4],[291,5,291,6],[272,6,272,12],[285,13,285,18],[274,10,274,11],[277,15,277,16],[275,8,275,18],[276,8,276,12],[277,8,277,12],[279,17,279,18],[276,15,276,16],[278,15,278,16],[279,15,279,16],[278,17,278,18],[280,15,280,16],[276,13,276,14],[292,9,292,10],[292,7,292,8],[293,7,294,8],[294,17,294,18],[291,7,291,8],[384,13,384,14],[293,17,293,18],[292,17,292,18],[293,11,294,12],[296,13,296,14],[295,13,295,14],[293,9,294,10],[293,15,293,16],[292,15,292,16],[293,13,294,14],[292,13,292,14],[294,15,294,16],[292,11,292,12],[296,17,296,18],[296,15,296,16],[296,11,296,12],[362,10,362,12],[362,13,362,15],[361,16,361,18],[362,16,362,18],[363,16,363,18],[319,13,319,14],[364,16,364,18],[360,16,360,18]]}
[]
[]
[]
[null,null,null,null,null,null,null,"CLASSIFICAÇÃO                                                                                                                                                                 USO INTERNO",null,null,null,"PROJETO DE PAVIMENTAÇÃO"]
[]
[null,null,null,null,null,null,null,null,null,null,null,"BELAGIO"]
[null,"PREFEITURA MUNICIPAL DE NOVA LIMA",null,null,null,null,null,null,null,null,null,"Nº CLIENTE",null,null,null,null,null,"PÁGINA"]
[null,"PROJETO DE INFRAESTRUTURA",null,null,null,null,null,null,null,null,null,"-",null,null,null,null,null,"1/ 6"]
[null,"ENSAIOS GEOTÉCNICOS DE LABORATÓRIO",null,null,null,null,null,null,null,null,null,"Nº (CONTRATADA)",null,null,null,null,null,"REV.",null,{"$f":"(100/(100+D29))","v":0.99936297557726395}]
[null,"RELATÓRIO TÉCNICO",null,null,null,null,null,null,null,null,null,"SND-PNL-030-RTE-04723-REVA",null,null,null,null,null,"A"]
[]
[null,"ANÁLISE GRANULOMÉTRICA E MASSA ESPECÍFICA DOS SÓLIDOS                                                                                                                                                   ABNT 7118 e ABNT 6458"]
[]
[null,"Cliente:","Prefeitura Municipal de Nova Lima",null,null,null,null,null,null,null,null,"Registro:",null,null,"0565",null,null,null,null,null,{"$f":"IF(E182=0,0,1)","v":1},{"$f":"ABS($E$182-$V$20)/$V$20*100","v":0.67475418644290719},{"$f":"IF(AND(V14>5,V14=V19),0,1)","v":1},{"$f":"IF(W14=0,0,$E$182)","v":24.999999999999964},{"$f":"IF(ABS(X14-$Y$20)/$Y$20*100=100,0,ABS(X14-$Y$20)/$Y$20*100)","v":2.0057710362112191},{"$f":"IF(OR(Y14=0,(AND(Y14>5,Y14=$X$19))),0,1)","v":1},{"$f":"IF(Z14=0,0,$E$182)","v":24.999999999999964},{"$f":"IF(ABS(AA14-$AB$20)/$AB$20*100=100,0,ABS(AA14-$AB$20)/$AB$20*100)","v":2.0057710362112191},{"$f":"IF(OR(AB14=0,(AND(AB14>5,AB14=$AA$19))),0,1)","v":1},{"$f":"IF(AC14=0,0,$E$182)","v":24.999999999999964},{"$f":"IF(ABS(AD14-$AE$20)/$AE$20*100=100,0,ABS(AD14-$AE$20)/$AE$20*100)","v":2.0057710362112191},{"$f":"IF(OR(AE14=0,(AND(AE14>5,AE14=$AD$19))),0,1)","v":1},{"$f":"IF(AF14=0,0,$E$182)","v":24.999999999999964},{"$f":"IF(ABS(AG14-$AH$20)/$AH$20*100=100,0,ABS(AG14-$AH$20)/$AH$20*100)","v":2.0057710362112191}]
[null,"Obra:","Pavimentação",null,null,null,null,null,null,null,null,"Furo:",null,null,"ST-02",null,null,null,null,null,{"$f":"IF(H182=0,0,1)","v":1},{"$f":"ABS($H$182-$V$20)/$V$20*100","v":5.2096530236701915},{"$f":"IF(AND(V15>5,V15=V19),0,1)","v":1},{"$f":"IF(W15=0,0,$H$182)","v":26.12612612612612},{"$f":"IF(ABS(X15-$Y$20)/$Y$20*100=100,0,ABS(X15-$Y$20)/$Y$20*100)","v":2.4083834216172271},{"$f":"IF(OR(Y15=0,(AND(Y15>5,Y15=$X$19))),0,1)","v":1},{"$f":"IF(Z15=0,0,$H$182)","v":26.12612612612612},{"$f":"IF(ABS(AA15-$AB$20)/$AB$20*100=100,0,ABS(AA15-$AB$20)/$AB$20*100)","v":2.4083834216172271},{"$f":"IF(OR(AB15=0,(AND(AB15>5,AB15=$AA$19))),0,1)","v":1},{"$f":"IF(AC15=0,0,$H$182)","v":26.12612612612612},{"$f":"IF(ABS(AD15-$AE$20)/$AE$20*100=100,0,ABS(AD15-$AE$20)/$AE$20*100)","v":2.4083834216172271},{"$f":"IF(OR(AE15=0,(AND(AE15>5,AE15=$AD$19))),0,1)","v":1},{"$f":"IF(AF15=0,0,$H$182)","v":26.12612612612612},{"$f":"IF(ABS(AG15-$AH$20)/$AH$20*100=100,0,ABS(AG15-$AH$20)/$AH$20*100)","v":2.4083834216172271}]
[null,"Local:","Belagio",null,null,null,null,null,null,null,null,"Profundidade:",null,null,"0,15 a 0,60 m",null,null,null,null,null,{"$f":"IF(K182=0,0,1)","v":1},{"$f":"ABS($K$182-$V$20)/$V$20*100","v":0.3220255579772468},{"$f":"IF(AND(V16>5,V16=V19),0,1)","v":1},{"$f":"IF(W16=0,0,$K$182)","v":24.752475247524735},{"$f":"IF(ABS(X16-$Y$20)/$Y$20*100=100,0,ABS(X16-$Y$20)/$Y$20*100)","v":2.9760109269417305},{"$f":"IF(OR(Y16=0,(AND(Y16>5,Y16=$X$19))),0,1)","v":1},{"$f":"IF(Z16=0,0,$K$182)","v":24.752475247524735},{"$f":"IF(ABS(AA16-$AB$20)/$AB$20*100=100,0,ABS(AA16-$AB$20)/$AB$20*100)","v":2.9760109269417305},{"$f":"IF(OR(AB16=0,(AND(AB16>5,AB16=$AA$19))),0,1)","v":1},{"$f":"IF(AC16=0,0,$K$182)","v":24.752475247524735},{"$f":"IF(ABS(AD16-$AE$20)/$AE$20*100=100,0,ABS(AD16-$AE$20)/$AE$20*100)","v":2.9760109269417305},{"$f":"IF(OR(AE16=0,(AND(AE16>5,AE16=$AD$19))),0,1)","v":1},{"$f":"IF(AF16=0,0,$K$182)","v":24.752475247524735},{"$f":"IF(ABS(AG16-$AH$20)/$AH$20*100=100,0,ABS(AG16-$AH$20)/$AH$20*100)","v":2.9760109269417305}]
[null,"Material:","Silte areno argiloso com pedregulho",null,null,null,null,null,null,null,null,"Coordenadas:",null,null,0,null,null,null,null,null,{"$f":"IF(N182=0,0,1)","v":1},{"$f":"ABS($N$182-$V$20)/$V$20*100","v":5.3791819521644069},{"$f":"IF(AND(V17>5,V17=V19),0,1)","v":1},{"$f":"IF(W17=0,0,$N$182)","v":26.168224299065351},{"$f":"IF(ABS(X17-$Y$20)/$Y$20*100=100,0,ABS(X17-$Y$20)/$Y$20*100)","v":2.5733985415357918},{"$f":"IF(OR(Y17=0,(AND(Y17>5,Y17=$X$19))),0,1)","v":1},{"$f":"IF(Z17=0,0,$N$182)","v":26.168224299065351},{"$f":"IF(ABS(AA17-$AB$20)/$AB$20*100=100,0,ABS(AA17-$AB$20)/$AB$20*100)","v":2.5733985415357918},{"$f":"IF(OR(AB17=0,(AND(AB17>5,AB17=$AA$19))),0,1)","v":1},{"$f":"IF(AC17=0,0,$N$182)","v":26.168224299065351},{"$f":"IF(ABS(AD17-$AE$20)/$AE$20*100=100,0,ABS(AD17-$AE$20)/$AE$20*100)","v":2.5733985415357918},{"$f":"IF(OR(AE17=0,(AND(AE17>5,AE17=$AD$19))),0,1)","v":1},{"$f":"IF(AF17=0,0,$N$182)","v":26.168224299065351},{"$f":"IF(ABS(AG17-$AH$20)/$AH$20*100=100,0,ABS(AG17-$AH$20)/$AH$20*100)","v":2.5733985415357918}]
[null,null,null,null,null,null,"EQUIPAMENTOS",null,null,null,null,null,null,null,null,null,null,null,null,null,{"$f":"IF(Q182=0,0,1)","v":1},{"$f":"ABS($Q$182-$V$20)/$V$20*100","v":10.941563604300216},{"$f":"IF(AND(V18>5,V18=V19),0,1)","v":0},{"$f":"IF(W18=0,0,$Q$182)","v":0},{"$f":"IF(ABS(X18-$Y$20)/$Y$20*100=100,0,ABS(X18-$Y$20)/$Y$20*100)","v":0},{"$f":"IF(OR(Y18=0,(AND(Y18>5,Y18=$X$19))),0,1)","v":0},{"$f":"IF(Z18=0,0,$Q$182)","v":0},{"$f":"IF(ABS(AA18-$AB$20)/$AB$20*100=100,0,ABS(AA18-$AB$20)/$AB$20*100)","v":0},{"$f":"IF(OR(AB18=0,(AND(AB18>5,AB18=$AA$19))),0,1)","v":0},{"$f":"IF(AC18=0,0,$Q$182)","v":0},{"$f":"IF(ABS(AD18-$AE$20)/$AE$20*100=100,0,ABS(AD18-$AE$20)/$AE$20*100)","v":0},{"$f":"IF(OR(AE18=0,(AND(AE18>5,AE18=$AD$19))),0,1)","v":0},{"$f":"IF(AF18=0,0,$Q$182)","v":0},{"$f":"IF(ABS(AG18-$AH$20)/$AH$20*100=100,0,ABS(AG18-$AH$20)/$AH$20*100)","v":0}]
[null,"Balança (n°):","BLÇ-001",null,null,null,null,null,"Estufa (n°):","ET-002",null,null,null,null,null,null,"Termômetro (n°):","TRM-007",null,null,null,{"$f":"MAX(V14:V18)","v":10.941563604300216},null,{"$f":"MAX(Y14:Y18)","v":2.9760109269417305},null,null,{"$f":"MAX(AB14:AB18)","v":2.9760109269417305},null,null,{"$f":"MAX(AE14:AE18)","v":2.9760109269417305},null,null,{"$f":"MAX(AH14:AH18)","v":2.9760109269417305}]
[null,"TEOR DE UMIDADE                                                                                                              ABNT 6457",null,null,null,null,null,null,null,"PENEIRAMENTO GRAÚDO                                                                                          ABNT 7181",null,null,null,null,null,null,null,null,null,null,"media  =",{"$f":"SUM(E182:S182)/SUM(U14:U18)","v":24.832442057620163},null,"media  =",{"$f":"SUM(X14:X18)/SUM(W14:W18)","v":25.511706418179038},null,"media  =",{"$f":"SUM(AA14:AA18)/SUM(Z14:Z18)","v":25.511706418179038},null,"media  =",{"$f":"SUM(AD14:AD18)/SUM(AC14:AC18)","v":25.511706418179038},null,"media  =",{"$f":"SUM(AG14:AG18)/SUM(AF14:AF18)","v":25.511706418179038}]
[]
[null,"CAPSULA (n°):",null,14,null,15,null,73,null,"RECIPIENTE (n°):",null,null,null,null,null,null,null,"G-27"]
[null,"CAPSULA + SOLO ÚMIDO (g):",null,72.209999999999994,null,78.16,null,75.98]
[null,"CAPSULA + SOLO SECO (g):",null,72.180000000000007,null,78.13,null,75.930000000000007,null,"PENEIRA (n°):",null,"ABERTURA (mm):",null,"PESO RETIDO (g):",null,"PESO RETIDO ACUMULADO (g):",null,"% DA AMOSTRA QUE PASSA (%):"]
[null,"TARA DA CAPSULA (g):",null,16.53,null,18.329999999999998,null,18.559999999999999]
[null,"ÁGUA (g):",null,2.9999999999986926E-2,null,3.0000000000001137E-2,null,4.9999999999997158E-2,null,"2\"",null,50,null,0,null,0,null,100]
[null,"SOLO SECO (g):",null,55.650000000000006,null,59.8,null,57.370000000000005,null,"1 1/2\"",null,38,null,0,null,0,null,100]
[null,"TEOR DE UMIDADE (%):",null,5.3908355795124749E-2,null,5.0167224080269461E-2,null,8.7153564580786394E-2,null,"1\"",null,25,null,141.1,null,141.1,null,96.257575374947251]
[null,"TEOR DE UMIDADE MÉDIO (%):",null,6.3743048152060208E-2,null,null,null,null,null,"3/4\"",null,19,null,103.78,null,244.88,null,93.504996866173528]
[null,"TEMPERATURA (°C):",null,null,null,null,null,110,null,"3/8\"",null,9.5,null,298.8,null,543.68000000000006,null,85.579862366061818]
[null,"AMOSTRA TOTAL",null,null,null,null,null,null,null,4,null,4.8,null,262.17,null,805.85000000000014,null,78.626272968825262]
[null,null,null,null,null,null,null,null,null,10,null,2,null,270.83,null,1076.68,null,71.442992591766199]
[null,"AMOSTRA TOTAL ÚMIDA (g):",null,null,null,null,null,3772,null,"PENEIRAMENTO FINO                                                                                                                                                  ABNT 7181"]
[null,"AMOSTRA TOTAL SECA (g):",null,null,null,null,null,3770.2830153329105]
[null,"RETIDO NA PENEIRA (2mm) n°10 (g):",null,null,null,null,null,1076.68,null,"RECIPIENTE (n°):",null,null,null,null,null,null,null,"F-05"]
[null,"PASSADO NA PENEIRA (2mm) n°10 (g):",null,null,null,null,null,2693.6030153329107]
[null,"SEDIMENTAÇÃO                                                                                                  ABNT 7181",null,null,null,null,null,null,null,"PENEIRA (n°):",null,"ABERTURA (mm):",null,"PESO RETIDO (g):",null,"PESO RETIDO ACUMULADO (g):",null,"% DA AMOSTRA QUE PASSA (%):"]
[]
[null,"DEFLOCULANTE:",null,null,null,null,null,"HEXA",null,16,null,1.2,null,1.64,null,1.64,null,69.769074925375364]
[null,"BÉQUER (n°):",null,null,null,null,null,"008",null,30,null,0.6,null,3.47,null,5.1100000000000003,null,66.227310106853309]
[null,"DENSIMETRO (n°):",null,null,null,null,null,1,null,40,null,0.42,null,1.1599999999999999,null,6.2700000000000005,null,65.043319562332954]
[null,"PROVETA (n°):",null,null,null,null,null,"007",null,50,null,0.3,null,1.04,null,7.3100000000000005,null,63.981810798280236]
[null,"PESO AMOSTRA ÚMIDA (g):",null,null,null,null,null,70.040000000000006,null,60,null,0.25,null,1.6,null,8.91,null,62.348720392045287]
[null,"PESO AMOSTRA SECA (g):",null,null,null,null,null,69.995382809431575,null,100,null,0.15,null,2.71,null,11.620000000000001,null,59.582673516484824,null,15]
[null,"DENSIDADE DOS GRÃOS d (g/cm3):",null,null,null,null,null,2.8896530890268872,null,200,null,7.4999999999999997E-2,null,2.92,null,14.540000000000001,null,56.602283525106031,null,30]
[null,"Hora",null,"Dt",null,"Leitura - L",null,"T (oC)",null,"Diâmetro dos Grãos (mm)",null,"Correção - CI",null,"Leit. Corrigida - Lc",null,null,"(%) Finos Totais",null,null,60]
[null,"08:26:00",null,"15\"",null,1036.5,null,21.9,null,8.7429505628773677E-2,null,-1.3184120199999825,null,1035.18,null,null,54.9,null,null,120]
[null,"08:26:30",null,"30\"",null,1036,null,21.9,null,6.2104796146028728E-2,null,-1.3184120199999825,null,1034.68,null,null,54.1,null,null,240]
[null,"08:27:00",null,"60\"",null,1034.5,null,21.9,null,4.45092413753677E-2,null,-1.3184120199999825,null,1033.18,null,null,51.8,null,null,480]
[null,"08:28:00",null,"2'",null,1033,null,21.9,null,3.188763305304735E-2,null,-1.3184120199999825,null,1031.68,null,null,49.4,null,null,900]
[null,"08:30:00",null,"4'",null,1031.25,null,21.9,null,2.2885440886980538E-2,null,-1.3184120199999825,null,1029.93,null,null,46.7,null,null,1800]
[null,"08:34:00",null,"8'",null,1028.5,null,21.9,null,1.5874413239180499E-2,null,-1.3184120199999825,null,1027.18,null,null,42.4,null,null,3600]
[null,"08:41:00",null,"15'",null,1026,null,21.9,null,1.1842275001707247E-2,null,-1.3184120199999825,null,1024.68,null,null,38.5,null,null,7200]
[null,"08:56:00",null,"30'",null,1023.25,null,21.9,null,8.5634299402539502E-3,null,-1.3184120199999825,null,1021.93,null,null,34.200000000000003,null,null,14400]
[null,"09:26:00",null,"1h",null,1019.75,null,22.1,null,6.206877321762904E-3,null,-1.2707567799999424,null,1018.48,null,null,28.8,null,null,28800]
[null,"10:26:00",null,"2h",null,1015.25,null,22.5,null,4.5131601898055485E-3,null,-1.1748774999999796,null,1014.08,null,null,22,null,null,86400]
[null,"12:26:00",null,"4h",null,1012.75,null,23.5,null,3.2083531642696618E-3,null,-0.93271249999997963,null,1011.82,null,null,18.399999999999999]
[null,"16:26:00",null,"8h",null,1009,null,22.1,null,2.365756822263595E-3,null,-1.2707567799999424,null,1007.73,null,null,12.1]
[null,1.351388888888889,null,"24h",null,1006,null,21.5,null,1.4020788675289889E-3,null,-1.4130625000000236,null,1004.59,null,null,7.2]
[]
[]
[]
[null,"Belo Horizonte, 17 de abril de 2023.",null,null,null,null,null,null,null,null,null,"Operador:",null,"André"]
[null,null,null,null,null,null,null,null,null,null,null,"Verificador:",null,"DLFF"]
[]
[null,"Nota: A repetição deste ensaio estará sujeita a aprovação prévia e por escrito da contratante."]
[null,null,null,null,null,null,null,"CLASSIFICAÇÃO                                                                                                                                                                 USO INTERNO",null,null,null,"PROJETO DE PAVIMENTAÇÃO"]
[]
[null,null,null,null,null,null,null,null,null,null,null,"BELAGIO"]
[null,"PREFEITURA MUNICIPAL DE NOVA LIMA",null,null,null,null,null,null,null,null,null,"Nº CLIENTE",null,null,null,null,null,"PÁGINA"]
[null,"PROJETO DE INFRAESTRUTURA",null,null,null,null,null,null,null,null,null,"-",null,null,null,null,null,"2/ 6"]
[null,"ENSAIOS GEOTÉCNICOS DE LABORATÓRIO",null,null,null,null,null,null,null,null,null,"Nº (CONTRATADA)",null,null,null,null,null,"REV."]
[null,"RELATÓRIO TÉCNICO",null,null,null,null,null,null,null,null,null,"SND-PNL-030-RTE-04723-REVA",null,null,null,null,null,"A"]
[]
[null,"ANÁLISE GRANULOMÉTRICA E MASSA ESPECÍFICA DOS SÓLIDOS                                                                                                                                                                       ABNT 7118 e ABNT 6458"]
[]
[null,"Cliente:","Prefeitura Municipal de Nova Lima",null,null,null,null,null,null,null,null,"Registro:",null,null,"0565"]
[null,"Obra:","Pavimentação",null,null,null,null,null,null,null,null,"Furo:",null,null,"ST-02"]
[null,"Local:","Belagio",null,null,null,null,null,null,null,null,"Profundidade:",null,null,"0,15 a 0,60 m",null,null,null,null,null,"2\"",50,null,{"$f":"100-R26","v":0}]
[null,"Material:","Silte areno argiloso com pedregulho",null,null,null,null,null,null,null,null,"Coordenadas:",null,null,0,null,null,null,null,null,"1 1/2\"",38,null,{"$f":"R26-R27","v":0},{"$f":"se","v":{"$error":"#NAME?"}}]
[null,null,null,null,null,null,"EQUIPAMENTOS"]
[null,"Balança (n°):","BLÇ-001",null,null,null,null,null,"Estufa (n°):","ET-002",null,null,null,null,null,null,"Termômetro (n°):","TRM-007"]
[null,null,null,null,null,null,null,null,null,null,null,null,null,null,null,null,null,null,null,null,"1\"",25,null,{"$f":"R27-R28","v":3.7424246250527489},null,null,null,null,null,null,null,null,null,{"$f":"L26","v":50},{"$f":"R26","v":100}]
[null,null,null,null,null,null,null,null,null,null,null,null,null,null,null,null,null,null,null,null,"3/4\"",19,null,{"$f":"R28-R29","v":2.7525785087737233},null,null,null,null,null,null,null,null,null,38,100]
[null,null,null,null,null,null,null,null,null,null,null,null,null,null,null,null,null,null,null,null,"3/8\"",9.5,null,{"$f":"R29-R30","v":7.9251345001117102},null,null,null,null,null,null,null,null,null,25,96.257575374947251]
[null,null,null,null,null,null,null,null,null,null,null,null,null,null,null,null,null,null,null,null,"No 4",4.8,null,{"$f":"R30-R31","v":6.9535893972365557},null,null,null,null,null,null,null,null,null,19,93.504996866173528]
[null,null,null,null,null,null,null,null,null,null,null,null,null,null,null,null,null,null,null,null,"No 10",2,null,{"$f":"R31-R32","v":7.183280377059063},null,null,null,null,null,null,null,null,null,9.5,85.579862366061818]
[null,null,null,null,null,null,null,null,null,null,null,null,null,null,null,null,null,null,null,null,null,null,null,null,null,null,null,null,null,null,null,null,null,4.8,78.626272968825262]
[null,null,null,null,null,null,null,null,null,null,null,null,null,null,null,null,null,null,null,null,16,1.2,null,{"$f":"R32-R39","v":1.6739176663908353},null,null,null,null,null,null,null,null,null,2,71.442992591766199]
[null,null,null,null,null,null,null,null,null,null,null,null,null,null,null,null,null,null,null,null,30,0.6,null,{"$f":"R39-R40","v":3.5417648185220543},null,null,null,null,null,null,null,null,null,{"$f":"L39","v":1.2},{"$f":"R39","v":69.769074925375364}]
[null,null,null,null,null,null,null,null,null,null,null,null,null,null,null,null,null,null,null,null,40,0.42,null,1.1839905445203556,null,null,null,null,null,null,null,null,null,0.6,66.227310106853309]
[null,null,null,null,null,null,null,null,null,null,null,null,null,null,null,null,null,null,null,null,50,0.3,null,1.0615087640527179,null,null,null,null,null,null,null,null,null,0.42,65.043319562332954]
[null,null,null,null,null,null,null,null,null,null,null,null,null,null,null,null,null,null,null,null,60,0.25,null,1.6330904062349489,null,null,null,null,null,null,null,null,null,0.3,63.981810798280236]
[null,null,null,null,null,null,null,null,null,null,null,null,null,null,null,null,null,null,null,null,100,0.15,null,2.7660468755604626,null,null,null,null,null,null,null,null,null,0.25,62.348720392045287]
[null,null,null,null,null,null,null,null,null,null,null,null,null,null,null,null,null,null,null,null,200,7.4999999999999997E-2,null,2.980389991378793,null,null,null,null,null,null,null,null,null,0.15,59.582673516484824]
[null,null,null,null,null,null,null,null,null,null,null,null,null,null,null,null,null,null,null,null,null,null,null,null,null,null,null,null,null,null,null,null,null,7.4999999999999997E-2,56.602283525106031]
[null,null,null,null,null,null,null,null,null,null,null,null,null,null,null,null,null,null,null,null,1,{"$f":"J47","v":8.7429505628773677E-2},null,{"$f":"IF(V97>0.06,R45-Q47,\"\")","v":1.7022835251060329},{"$f":"IF(AND(V97<=0.06,V97>0.002),R45-Q47, \" \")","v":" "},{"$f":"IF(V97<=0.002,R45-Q47, \"\")","v":""},null,null,null,null,null,null,null,{"$f":"J47","v":8.7429505628773677E-2},{"$f":"Q47","v":54.9}]
[null,null,null,null,null,null,null,null,null,null,null,null,null,null,null,null,null,null,null,null,2,6.2104796146028728E-2,null,{"$f":"IF(V98>0.06,Q47-Q48,\"\")","v":0.79999999999999716},{"$f":"IF(AND(V98<=0.06,V98>0.002),Q47-Q48, \" \")","v":" "},{"$f":"IF(V98<=0.002,Q47-Q48, \"\")","v":""},null,null,null,null,null,null,null,6.2104796146028728E-2,54.1]
[null,null,null,null,null,null,null,null,null,null,null,null,null,null,null,null,null,null,null,null,3,4.45092413753677E-2,null,"",2.3000000000000043,"",null,null,null,null,null,null,null,4.45092413753677E-2,51.8]
[null,null,null,null,null,null,null,null,null,null,null,null,null,null,null,null,null,null,null,null,4,3.188763305304735E-2,null,"",2.3999999999999986,"",null,null,null,null,null,null,null,3.188763305304735E-2,49.4]
[null,"Argila",null,null,12.1,null,null,null,"%","Þ",null,null,null,null,"f < 0,002 mm",null,null,null,null,null,5,2.2885440886980538E-2,null,"",2.6999999999999957,"",null,null,null,null,null,null,null,2.2885440886980538E-2,46.7]
[null,"Silte",null,null,42,null,null,null,"%","Þ",null,null,null,null,"0,002 mm < f < 0,06 mm",null,null,null,null,null,6,1.5874413239180499E-2,null,"",4.3000000000000043,"",null,null,null,null,null,null,null,1.5874413239180499E-2,42.4]
[null,"Areia Fina",null,null,8.2487203920452856,null,null,null,"%","Þ",null,null,null,null,"0,06 mm < f < 0,2 mm",null,null,null,null,null,7,1.1842275001707247E-2,null,"",3.8999999999999986,"",null,null,null,null,null,null,null,1.1842275001707247E-2,38.5]
[null,"Areia Média",null,null,7.4203545333300767,null,null,null,"%","Þ",null,null,null,null,"0,2 mm < f < 0,6 mm",null,null,null,null,null,8,8.5634299402539502E-3,null,"",4.2999999999999972,"",null,null,null,null,null,null,null,8.5634299402539502E-3,34.200000000000003]
[null,"Areia Grossa",null,null,8.8571980434498983,null,null,null,"%","Þ",null,null,null,null,"0,6 mm < f < 2 mm",null,null,null,null,null,9,6.206877321762904E-3,null,"",5.4000000000000021,"",null,null,null,null,null,null,null,6.206877321762904E-3,28.8]
[null,"Pedregulho Fino",null,null,6.9535893972365557,null,null,null,"%","Þ",null,null,null,null,"2 mm < f < 6 mm",null,null,null,null,null,10,4.5131601898055485E-3,null,"",6.8000000000000007,"",null,null,null,null,null,null,null,4.5131601898055485E-3,22]
[null,"Pedregulho Médio",null,null,10.677713008885434,null,null,null,"%","Þ",null,null,null,null,"6 mm < f < 20 mm",null,null,null,null,null,11,3.2083531642696618E-3,null,"",3.6000000000000014,"",null,null,null,null,null,null,null,3.2083531642696618E-3,18.399999999999999]
[null,"Pedregulho Grosso",null,null,3.7424246250527489,null,null,null,"%","Þ",null,null,null,null,"f > 20 mm",null,null,null,null,null,12,2.365756822263595E-3,null,"",6.2999999999999989,"",null,null,null,null,null,null,null,2.365756822263595E-3,12.1]
[null,"Total",null,null,100,null,null,null,null,null,null,null,null,null,null,null,null,null,null,null,13,1.4020788675289889E-3,null,{"$f":"IF(V109>0.06,(Q58-Q59)+Q59,\"\")","v":""},{"$f":"IF(AND(V109<=0.06,V109>0.002),(Q58-Q59)+Q59, \" \")","v":" "},{"$f":"IF(V109<=0.002,(Q58-Q59)+Q59, \"\")","v":12.1},null,null,null,null,null,null,null,1.4020788675289889E-3,7.2]
[null,"Argila = ",null,null,12.1,null,null,null,null,"Areia = ",null,null,null,null,24.526272968825261]
[null,"Silte = ",null,null,42,null,null,null,null,"Pedregulho =",null,null,null,null,21.373727031174738,null,null,null,null,null,null,null,{"$f":"SUM(X79:X95)","v":43.397716474893969},null,{"$f":"SUM(X97:X109,Y97:Y109,Z97:Z109)","v":56.602283525106031}]
[null,"DETERMINAÇÃO DA MASSA ESPECÍFICA DOS SÓLIDOS                       Grãos < # 4,8 mm (ABNT 6458)"]
[null,"REPETIÇÃO TEOR DE UMIDADE",null,null,null,null,null,null,null,null,null,null,null,null,null,null,null,"Não",null,null,"Sim","TEOR DE UMIDADE                                                                               ABNT 6457"]
[null,"PICNOMETRO (n°):","SOLO ÚMIDO (g)","PICNÔMETRO +  SOLO + ÁGUA (g):",null,"T (C°):",null,"PICNÔMETRO + ÁGUA (g):",null,"SOLO SECO (g):",null,"VOLUME DESLOCADO (g):",null,"d (g/cm³)",null,"Diferença (g/cm³)",null,"d med (g/cm³)",null,null,"Não"]
[null,null,null,null,null,null,null,null,null,null,null,null,null,null,null,null,null,null,null,null,null,"CAPSULA (n°):"]
[null,2,55.04,667.41,null,20.8,null,631.41,null,55.004938175772601,null,19.004938175772622,null,2.8886296860305243,null,-2.0468059927263305E-3,null,2.8896530890268872,null,null,null,"CAPSULA + SOLO ÚMIDO (g):"]
[null,15,55.05,659.48,null,20.8,null,623.46,null,55.014931805528377,null,18.994931805528381,null,2.8906764920232506,null,null,null,null,null,null,{"$f":"D116-H116","v":36},"CAPSULA + SOLO SECO (g):"]
[null,"LIMITE DE LIQUIDEZ (LL):",null,39.200000000000003,null,"% QUE PASSA",null,"#1\" (25mm):",null,96.257575374947251,null,"#4 (4,8mm):",null,78.626272968825262,null,"#200 (0,075mm):",null,56.602283525106031,null,null,{"$f":"D117-H117","v":36.019999999999982},"TARA DA CAPSULA (g):",null,{"$f":"VLOOKUP(X115,TABELAS!$A:$B,2,FALSE)","v":{"$error":"#N/A"}},{"$f":"VLOOKUP(Y115,TABELAS!$A:$B,2,FALSE)","v":{"$error":"#N/A"}},{"$f":"VLOOKUP(Z115,TABELAS!$A:$B,2,FALSE)","v":{"$error":"#N/A"}}]
[null,"LIMITE DE PLASTICIDADE (LP):",null,25.511706418179038,null,null,null,"#3/4\" (19mm):",null,93.504996866173528,null,"# 10 (2mm):",null,71.442992591766199,null,null,null,null,null,null,{"$f":"U117-U118","v":-1.999999999998181E-2},"ÁGUA (g):",null,{"$f":"X116-X117","v":0},0,0]
[null,"ÍNDICE DE PLASTICIDADE (IP):",null,13.688293581820965,null,null,null,"#3/8\" (9,5mm):",null,85.579862366061818,null,"#40 (0,42mm):",null,65.043319562332954,null,null,null,null,null,null,null,"SOLO SECO (g):",null,{"$error":"#N/A"},{"$error":"#N/A"},{"$error":"#N/A"}]
[null,"CLASSIFICAÇÃO HRB (Highway Research Board)",null,null,null,null,null,null,"CLASSIFICAÇÃO S.U.C.S (Sistema Unificado de Classificação do Solo)",null,null,null,null,null,null,null,null,null,null,null,null,"TEOR DE UMIDADE (%):",null,{"$f":"(X119/X120)*100","v":{"$error":"#N/A"}},{"$f":"(Y119/Y120)*100","v":{"$error":"#N/A"}},{"$f":"(Z119/Z120)*100","v":{"$error":"#N/A"}}]
[null,"IG",5.7957741377495928,null,"HRB",null," ",null,"ML",null,null,null,null,null,null,null,null,null,null,null,null,"TEOR DE UMIDADE MÉDIO (%):",null,{"$f":"AVERAGE(X121:Z121)","v":{"$error":"#N/A"}}]
[null,"SOLOS FINOS",null,null,null,null,null,null,null,null,"SOLOS GROSSOS"]
[null,"L: baixa compressibilidade",null,null,"O: silte ou argila orgânicos",null,null,null,null,null,"G: pedregulho",null,null,null,"P: mal graduado"]
[null,"H: alta compressibilidade",null,null,"C: argila inorgânica",null,null,null,null,null,"S: areia",null,null,null,"C: com argila"]
[null,"M: silte",null,null,null,null,null,null,null,null,"W: bem graduado"]
[]
[null,"Belo Horizonte, 17 de abril de 2023.",null,null,null,null,null,null,null,null,null,"Operador:",null,"André"]
[null,null,null,null,null,null,null,null,null,null,null,"Verificador:",null,"DLFF"]
[]
[null,"Nota: A repetição deste ensaio estará sujeita a aprovação prévia e por escrito da contratante."]
[null,null,null,null,null,null,null,"CLASSIFICAÇÃO                                                                                                                                                                 USO INTERNO",null,null,null,"PROJETO DE PAVIMENTAÇÃO"]
[]
[null,null,null,null,null,null,null,null,null,null,null,"BELAGIO"]
[null,"PREFEITURA MUNICIPAL DE NOVA LIMA",null,null,null,null,null,null,null,null,null,"Nº CLIENTE",null,null,null,null,null,"PÁGINA"]
[null,"PROJETO DE INFRAESTRUTURA",null,null,null,null,null,null,null,null,null,"-",null,null,null,null,null,"3/ 6"]
[null,"ENSAIOS GEOTÉCNICOS DE LABORATÓRIO",null,null,null,null,null,null,null,null,null,"Nº (CONTRATADA)",null,null,null,null,null,"REV."]
[null,"RELATÓRIO TÉCNICO",null,null,null,null,null,null,null,null,null,"SND-PNL-030-RTE-04723-REVA",null,null,null,null,null,"A"]
[]
[null,"LIMITE DE LIQUIDEZ  E PLASTICIDADE                                                                                                                                                                                                       ABNT 6459 e ABNT 7180"]
[]
[null,"Cliente:","Prefeitura Municipal de Nova Lima",null,null,null,null,null,null,null,null,"Registro:",null,null,"0565"]
[null,"Obra:","Pavimentação",null,null,null,null,null,null,null,null,"Furo:",null,null,"ST-02"]
[null,"Local:","Belagio",null,null,null,null,null,null,null,null,"Profundidade:",null,null,"0,15 a 0,60 m"]
[null,"Material:","Silte areno argiloso com pedregulho",null,null,null,null,null,null,null,null,"Coordenadas:",null,null,0]
[null,null,null,null,null,null,"EQUIPAMENTOS"]
[null,"Balança (n°):","BLÇ-001",null,null,null,null,null,null,null,null,null,null,null,null,null,"Estufa (n°):","ET-002"]
[null,"L I M I T E  D E  L I Q U I D E Z - NBR 6459"]
[null,"CAPSULA (n°):",null,null,17,null,null,67,null,null,47,null,null,84,null,null,2]
[null,"CAPSULA + SOLO ÚMIDO (g):               ",null,null,12.8,null,null,13.61,null,null,12.36,null,null,12.11,null,null,11.68]
[null,"CAPSULA + SOLO SECO (g):",null,null,10.64,null,null,11.11,null,null,10.66,null,null,10.45,null,null,9.8800000000000008]
[null,"ÁGUA (g):",null,null,2.16,null,null,2.5,null,null,1.6999999999999993,null,null,1.6600000000000001,null,null,1.7999999999999989]
[null,"TARA DA CAPSULA (g):",null,null,5.65,null,null,5.12,null,null,6.21,null,null,6.04,null,null,5.01]
[null,"PESO DE SOLO SECO (g):",null,null,4.99,null,null,5.9899999999999993,null,null,4.45,null,null,4.4099999999999993,null,null,4.870000000000001]
[null,"TEOR DE UMIDADE (%):",null,null,43.286573146292582,null,null,41.736227045075132,null,null,38.202247191011217,null,null,37.641723356009081,null,null,36.960985626283339]
[null,"GOLPES (n°):",null,null,14,null,null,21,null,null,25,null,null,31,null,null,35]
[]
[]
[]
[]
[]
[]
[]
[]
[null,null,null,null,null,null,null,null,null,null,null,null,null,null,null,null,null,null,null,null,"LL"]
[null,null,null,null,null,null,null,null,null,null,null,null,null,null,null,null,null,null,null,null,39.200000000000003]
[null,null,null,null,null,null,null,null,null,null,null,null,null,null,null,null,null,null,null,null,null,25]
[]
[]
[]
[]
[]
[]
[]
[null,"L I M I T E  D E  P  L A S T I C I D A D E - NBR 7180"]
[null,"CAPSULA (n°):",null,null,21,null,null,61,null,null,70,null,null,92,null,null,96]
[null,"CAPSULA + SOLO ÚMIDO (g):               ",null,null,6.92,null,null,7.16,null,null,7.32,null,null,7.01,null,null,7.48]
[null,"CAPSULA + SOLO SECO (g):",null,null,6.61,null,null,6.87,null,null,7.07,null,null,6.73,null,null,7.25]
[null,"ÁGUA (g):",null,null,0.30999999999999961,null,null,0.29000000000000004,null,null,0.25,null,null,0.27999999999999936,null,null,0.23000000000000043]
[null,"TARA DA CAPSULA (g):",null,null,5.37,null,null,5.76,null,null,6.06,null,null,5.66,null,null,6.21]
[null,"PESO DE SOLO SECO (g):",null,null,1.2400000000000002,null,null,1.1100000000000003,null,null,1.0100000000000007,null,null,1.0700000000000003,null,null,1.04]
[null,"TEOR DE UMIDADE (%):",null,null,24.999999999999964,null,null,26.12612612612612,null,null,24.752475247524735,null,null,26.168224299065351,null,null,22.115384615384656,null,null,null,"5% média"]
[null,"Média 1",null,null,24.832442057620163,null,null,null,null,null,null,null,null,null,null,null,null,null,null,null,{"$f":"E184*(5%)","v":1.275585320908952}]
[null,"Média 2 (excluindo ponto)",null,null,25.511706418179038]
[null,null,null,null,null,null,null,null,null,null,null,null,null,null,null,null,null,null,null,null,{"$f":"E184+U183","v":26.787291739087991}]
[null,null,"RESULTADOS",null,null,null,null,null,null,null,null,null,null,null,null,null,null,null,null,null,{"$f":"E184-U183","v":24.236121097270086}]
[null,null,"LIMITE DE LIQUIDEZ (%):",null,null,null,null,null,null,39.200000000000003]
[null,null,"LIMITE DE PLASTICIDADE (%):",null,null,null,null,null,null,25.511706418179038,null,null,null,null,null,null,null,null,null,null,{"$f":"IF(AND(J182>=$U$186,J182<=$U$185),J182,\"0\")","v":"0"},{"$f":"IF(AND(M182>=$U$186,M182<=$U$185),M182,\"nok\")","v":"nok"},{"$f":"IF(AND(O182>=$U$186,O182<=$U$185),O182,\"nok\")","v":"nok"},{"$f":"IF(AND(Q182>=$U$186,Q182<=$U$185),Q182,\"nok\")","v":"nok"},{"$f":"IF(AND(R182>=$U$186,R182<=$U$185),R182,\"nok\")","v":"nok"}]
[null,null,"ÍNDICE DE PLASTICIDADE (%):",null,null,null,null,null,null,13.688293581820965]
[]
[]
[null,"Belo Horizonte, 17 de abril de 2023.",null,null,null,null,null,null,null,null,null,"Operador:",null,"Sandro"]
[null,null,null,null,null,null,null,null,null,null,null,"Verificador:",null,"DLFF"]
[]
[null,"Nota: A repetição deste ensaio estará sujeita a aprovação prévia e por escrito da contratante."]
[null,null,null,null,null,null,null,"CLASSIFICAÇÃO                                                                                                                                                                 USO INTERNO",null,null,null,"PROJETO DE PAVIMENTAÇÃO"]
[]
[null,null,null,null,null,null,null,null,null,null,null,"BELAGIO"]
[null,"PREFEITURA MUNICIPAL DE NOVA LIMA",null,null,null,null,null,null,null,null,null,"Nº CLIENTE",null,null,null,null,null,"PÁGINA"]
[null,"PROJETO DE INFRAESTRUTURA",null,null,null,null,null,null,null,null,null,"-",null,null,null,null,null,"4/ 6"]
[null,"ENSAIOS GEOTÉCNICOS DE LABORATÓRIO",null,null,null,null,null,null,null,null,null,"Nº (CONTRATADA)",null,null,null,null,null,"REV."]
[null,"RELATÓRIO TÉCNICO",null,null,null,null,null,null,null,null,null,"SND-PNL-030-RTE-04723-REVA",null,null,null,null,null,"A"]
[]
[null,"TEOR DE UMIDADE NATURAL                                                                                                                                                                                    ABNT 6457"]
[]
[null,"Cliente:","Prefeitura Municipal de Nova Lima",null,null,null,null,null,null,null,null,"Registro:",null,null,"0565"]
[null,"Obra:","Pavimentação",null,null,null,null,null,null,null,null,"Furo:",null,null,"ST-02"]
[null,"Local:","Belagio",null,null,null,null,null,null,null,null,"Profundidade:",null,null,"0,15 a 0,60 m"]
[null,"Material:","Silte areno argiloso com pedregulho",null,null,null,null,null,null,null,null,"Coordenadas:",null,null,0]
[null,null,null,null,null,null,"EQUIPAMENTOS"]
[null,"Balança (n°):","BLÇ-001",null,null,null,null,null,"Estufa (n°):","ET-002",null,null,null,null,null,null,"Termômetro (n°):","TRM-007"]
[null,"TEMPERATURA (°C):",null,110]
[null,"CAPSULA (n°):",null,null,14,null,null,null,null,48,null,null,null,null,63]
[null,"CAPSULA + SOLO ÚMIDO (g):",null,null,58.99,null,null,null,null,55.06,null,null,null,null,56.36]
[null,"CAPSULA + SOLO SECO (g):",null,null,51.74,null,null,null,null,48.48,null,null,null,null,49.78]
[null,"TARA DA CAPSULA (g):",null,null,16.53,null,null,null,null,18.329999999999998,null,null,null,null,18.05]
[null,"ÁGUA (g):",null,null,7.25,null,null,null,null,6.5800000000000054,null,null,null,null,6.5799999999999983]
[null,"SOLO SECO (g):",null,null,35.21,null,null,null,null,30.15,null,null,null,null,31.73]
[null,"TEOR DE UMIDADE (%):",null,null,20.590741266685601,null,null,null,null,21.824212271973483,null,null,null,null,20.737472423573898,null,null,null,null,null,{"$f":"$E$220-V219","v":19.998268221373777},{"$f":"$E$220*5%","v":1.052540432703883}]
[null,"TEOR DE UMIDADE MÉDIO (%):",null,null,21.05080865407766,null,null,null,null,null,null,null,null,null,null,null,null,null,null,null,{"$f":"$E$220+V220","v":22.103349086781542},{"$f":"$E$220*5%","v":1.052540432703883}]
[]
[]
[]
[]
[null,null,"                    "]
[]
[]
[]
[]
[]
[]
[]
[]
[]
[]
[]
[]
[]
[]
[]
[]
[]
[]
[]
[]
[]
[]
[]
[]
[]
[]
[]
[]
[]
[null,"Belo Horizonte, 17 de abril de 2023.",null,null,null,null,null,null,null,null,null,"Operador:"]
[null,null,null,null,null,null,null,null,null,null,null,"Verificador:",null,"DLFF"]
[]
[null,"Nota: A repetição deste ensaio estará sujeita a aprovação prévia e por escrito da contratante."]
[null,null,null,null,null,null,null,"CLASSIFICAÇÃO                                                                                                                                                                 USO INTERNO",null,null,null,"PROJETO DE PAVIMENTAÇÃO"]
[]
[null,null,null,null,null,null,null,null,null,null,null,"BELAGIO"]
[null,"PREFEITURA MUNICIPAL DE NOVA LIMA",null,null,null,null,null,null,null,null,null,"Nº CLIENTE",null,null,null,null,null,"PÁGINA"]
[null,"PROJETO DE INFRAESTRUTURA",null,null,null,null,null,null,null,null,null,"-",null,null,null,null,null,"5/ 6"]
[null,"ENSAIOS GEOTÉCNICOS DE LABORATÓRIO",null,null,null,null,null,null,null,null,null,"Nº (CONTRATADA)",null,null,null,null,null,"REV."]
[null,"RELATÓRIO TÉCNICO",null,null,null,null,null,null,null,null,null,"SND-PNL-030-RTE-04723-REVA",null,null,null,null,null,"A"]
[]
[null,"ENSAIO DE COMPACTAÇÃO                                                                                                                                                                                                                                                          ABNT 7182 "]
[]
[null,"Cliente:","Prefeitura Municipal de Nova Lima",null,null,null,null,null,null,null,null,"Registro:",null,null,"0565"]
[null,"Obra:","Pavimentação",null,null,null,null,null,null,null,null,"Furo:",null,null,"ST-02"]
[null,"Local:","Belagio",null,null,null,null,null,null,null,null,"Profundidade:",null,null,"0,15 a 0,60 m"]
[null,"Material:","Silte areno argiloso com pedregulho",null,null,null,null,null,null,null,null,"Coordenadas:",null,null,0]
[null,null,null,null,null,null,"EQUIPAMENTOS"]
[null,"Balança (n°):","BLÇ-001",null,null,null,null,null,null,null,null,null,null,null,null,null,"Estufa (n°):","ET-002"]
[null,"Cilindro:","Grande",null,null,null,null,null,null,"Energia:","Normal",null,null,null,null,null,"Golpes (n°):",12]
[null,"Peso do Material (g):",null,null,null,6000,null,null,"Umidade:"]
[null,null,null,null,null,null,null,null,"CAPSULA (n°):",null,null,null,null,5,null,9,null,7]
[null,null,null,null,null,null,null,null,"CAPSULA + SOLO ÚMIDO (g):",null,null,null,null,335.68,null,332.42,null,352.87]
[null,"Peso do Material Seco (g):",null,null,null,5658.5408397531646,null,null,"CAPSULA + SOLO SECO (g):",null,null,null,null,320.58,null,318.44,null,338.47]
[null,null,null,null,null,null,null,null,"ÁGUA (g):",null,null,null,null,15.100000000000023,null,13.980000000000018,null,14.399999999999977]
[null,null,null,null,null,null,null,null,"TARA DA CAPSULA (g):",null,null,null,null,80.19,null,81.86,null,94.92]
[null,"Peso da Água (g):",null,null,null,341.45916024683538,null,null,"SOLO SECO (g):",null,null,null,null,240.39,null,236.57999999999998,null,243.55]
[null,null,null,null,null,null,null,null,"TEOR DE UMIDADE (%):",null,null,null,null,6.2814592953117945,null,5.9092061881815958,null,5.9125436255388939]
[null,null,null,null,null,null,null,null,"TEOR DE UMIDADE MÉDIO (%):",null,null,null,null,6.034403036344095]
[null,"Fator de Correção:",null,null,null,"Umidade Ótima (%)",null,null,null,null,null,null,null,"Densidade Seca Máxima (g/cm³)"]
[null,0.94309013995886082]
[null,"CILINDRO N°:",null,null,null,68,null,20,null,39,null,96,null,65,null,"FRACIONAMENTO DE AMOSTRAS"]
[null,"UMIDADE DE CÁLCULO (%):",null,null,null,14.517155279251618,null,16.637843339978499,null,18.75853140070538,null,20.879219461432264,null,22.999907522159148]
[null,"ÁGUA A ADICIONAR (%):",null,null,null,8,null,10,null,12,null,14,null,16,null,"PENEIRAS",null,"% MATERIAL RETIDO"]
[null,"ÁGUA A ADICIONAR (g):",null,null,null,480,null,600,null,720,null,840,null,960]
[null,"CILINDRO + SOLO + ÁGUA (g):",null,null,null,8040,null,8315,null,8385,null,9055,null,8315,null,"3\""]
[null,"CILINDRO (g):",null,null,null,4134,null,4254,null,4182,null,4776,null,4182,null,"3/4\""]
[null,"SOLO + ÁGUA (g):",null,null,null,3906,null,4061,null,4203,null,4279,null,4133,null,"Nº 4"]
[null,"VOLUME DO SOLO [Volume do cilindro (cm³)]",null,null,null,2058,null,2063,null,2078,null,2090,null,2063,null,"FUNDO"]
[null,null,null,null,null,null,null,null,null,null,null,null,null,null,null,"TOTAL",null,0]
[null,"DENSIDADE ÚMIDA (g/cm³):",null,null,null,1.8979591836734695,null,1.9684924866698983,null,2.0226179018286814,null,2.0473684210526315,null,2.0033931168201646,null,"SECÁGEM PRÉVIA"]
[null,"DENSIDADE CONVERTIDA (g/cm³):",null,null,null,1.7573696145124718,null,1.7895386242453621,null,1.8059088409184656,null,1.7959372114496768,null,1.727063031741521,null,"Sim",null," Não"]
[null,"DENSIDADE SECA (g/cm³):",null,null,null,1.657357955710016,null,1.6876962316013457,null,1.7031348215347397,null,1.6937306761034019,null,1.6287761163228855,null,"x"]
[]
[]
[]
[]
[]
[]
[]
[]
[]
[]
[]
[]
[]
[]
[]
[]
[]
[]
[]
[]
[]
[null,"Belo Horizonte, 17 de abril de 2023.",null,null,null,null,null,null,null,null,null,"Operador:",null,"Igor"]
[null,null,null,null,null,null,null,null,null,null,null,"Verificador:",null,"DLFF"]
[]
[null,"Nota: A repetição deste ensaio estará sujeita a aprovação prévia e por escrito da contratante."]
[null,null,null,null,null,null,null,"CLASSIFICAÇÃO                                                                                                                                                                 USO INTERNO",null,null,null,"PROJETO DE PAVIMENTAÇÃO"]
[]
[null,null,null,null,null,null,null,null,null,null,null,"BELAGIO"]
[null,"PREFEITURA MUNICIPAL DE NOVA LIMA",null,null,null,null,null,null,null,null,null,"Nº CLIENTE",null,null,null,null,null,"PÁGINA"]
[null,"PROJETO DE INFRAESTRUTURA",null,null,null,null,null,null,null,null,null,"-",null,null,null,null,null,"6/ 6"]
[null,"ENSAIOS GEOTÉCNICOS DE LABORATÓRIO",null,null,null,null,null,null,null,null,null,"Nº (CONTRATADA)",null,null,null,null,null,"REV."]
[null,"RELATÓRIO TÉCNICO",null,null,null,null,null,null,null,null,null,"SND-PNL-030-RTE-04723-REVA",null,null,null,null,null,"A"]
[]
[null,"ÍNDICE DE SUPORTE CALIFÓRNIA                                                                                                                                                                            ABNT 9895"]
[]
[null,"Cliente:","Prefeitura Municipal de Nova Lima",null,null,null,null,null,null,null,null,"Registro:",null,null,"0565"]
[null,"Obra:","Pavimentação",null,null,null,null,null,null,null,null,"Furo:",null,null,"ST-02"]
[null,"Local:","Belagio",null,null,null,null,null,null,null,null,"Profundidade:",null,null,"0,15 a 0,60 m"]
[null,"Material:","Silte areno argiloso com pedregulho",null,null,null,null,null,null,null,null,"Coordenadas:",null,null,0]
[null,"Extensômetro (n°):",null,null,null,null,null,null,null,null,null,null,null,null,null,null,"Prensa (n°):"]
[null,"P   E   N   E   T   R   A   Ç   Ã   O"]
[null,"Cilindro (n°)","Penetração (mm)",null,null,0.63,1.27,1.9,2.54,3.17,3.81,4.4400000000000004,5.08,6.35,7.62,8.89,10.16,11.43,12.7]
[null,null,"Tempo (mín)",null,null,0.5,1,1.5,2,2.5,3,3.5,4,5,6,7,8,9,10]
[null,68,"Carga",null,null,6.8,10.5,14.9,19.100000000000001,21.8,25.3,28.4,31.6,38.9,45.5,51.3,56.5,62.6,68]
[null,null,"Pressão (kgf/cm2)",null,null,0.35335287844910135,0.54561841525228882,0.77425851307229565,0.9925058791732112,1.1328077573809425,1.3146805624650388,1.4757679041109526,1.6420516116164123,2.0213863193632413,2.3643464660932518,2.6657356859468968,2.9359467106432686,3.2529250280755506,3.5335287844910135]
[null,null,"I.S.C.",null,null,null,null,null,1.4093583484259598,null,null,null,1.5599490310355917]
[null,20,"Carga",null,null,5.8,11,15.8,20,25.9,30.7,36.200000000000003,40.9,50.1,59.5,68.400000000000006,77.099999999999994,85.6,93.2]
[null,null,"Pressão (kgf/cm2)",null,null,0.30138921985364525,0.5716002445500169,0.82102580580820617,1.0392731719091217,1.3458587576223124,1.5952843188805017,1.8810844411555103,2.1253136365541536,2.6033792956323496,3.0918376864296371,3.5543142479291965,4.0063980777096635,4.4480891757710399,4.843012981096507]
[null,null,"I.S.C.",null,null,null,null,null,1.4757679041109528,null,null,null,2.0190479547264459]
[null,39,"Carga",null,null,9.9,14.2,19,24.2,30.1,36.1,41.9,48.2,60.5,73.3,84.7,95.9,106.5,118.2]
[null,null,"Pressão (kgf/cm2)",null,null,0.51444022009501522,0.7378839520554763,0.98730951331366557,1.2575205380100372,1.5641061237232281,1.8758880752959646,2.1772772951496098,2.5046483443009833,3.1438013450250928,3.8089361750469308,4.4013218830351306,4.9833148593042385,5.5341296404160731,6.1421044459829091]
[null,null,"I.S.C.",null,null,null,null,null,1.7856791639742526,null,null,null,2.3794159270859341]
[null,96,"Carga",null,null,7.2,12.5,17.8,23.2,28.6,34.5,40.299999999999997,46.3,58.1,70.599999999999994,81.900000000000006,92.2,102.3,112.2]
[null,null,"Pressão (kgf/cm2)",null,null,0.37413834188728379,0.64954573244320102,0.92495312299911825,1.205556879414581,1.4861606358300441,1.7927462215432348,2.09413544139688,2.4059173929696165,3.0190885643959984,3.6686342968391989,4.2558236389678532,4.7910493225010509,5.3158822743151566,5.8303224944101721]
[null,null,"I.S.C.",null,null,null,null,null,1.7118907687687051,null,null,null,2.2856215233211357]
[null,65,"Carga",null,null,15.3,20.6,24.7,28.2,31.9,35.299999999999997,38.6,42.2,49.1,55.7,62.1,68.2,74.7,79.5]
[null,null,"Pressão (kgf/cm2)",null,null,0.79504397651047809,1.0704513670663953,1.2835023673077652,1.4653751723918615,1.6576407091950489,1.8343171484195995,2.0057972217846047,2.1928663927282468,2.5514156370368939,2.894375783766904,3.2269431987778225,3.543921516210105,3.8816852970805695,4.1311108583387588]
[null,null,"I.S.C.",null,null,null,null,null,2.0808327447964432,null,null,null,2.0832230730918342]
[null,"Dimensões do Pistão:",null,null,null,null,null,"diâmetro =",4.95,"cm",null,"área =",19.244218498645978,"cm²"]
[null,"E    X    P    A    N    S    Ã    O"]
[null,"Nº . CILINDRO",null,null,68,null,null,20,null,null,39,null,null,96,null,null,65]
[null,"DATA:",null,null,null,null,null,null,null,null,null,null,null,null,null,null,null,null,null,null,"EXPANSÃO CBR"]
[null,"2023-04-04",null,null,6.95,null,null,6.59,null,null,6.2,null,null,4.22,null,null,3.51,null,null,0,{"$f":"E361-2","v":4.95},{"$f":"H361-2","v":4.59},{"$f":"K361-2","v":4.2},{"$f":"N361-2","v":2.2199999999999998},{"$f":"Q361-2","v":1.5099999999999998}]
[null,"2023-04-05",null,null,6.7,null,null,6.43,null,null,6.25,null,null,4.42,null,null,3.5,null,null,null,{"$f":"E362-2","v":4.7},{"$f":"H362-2","v":4.43},{"$f":"K362-2","v":4.25},{"$f":"N362-2","v":2.42},{"$f":"Q362-2","v":1.5}]
[null,"2023-04-06",null,null,null,null,null,null,null,null,null,null,null,null,null,null,null,null,null,null,{"$f":"E363-2","v":-2},{"$f":"H363-2","v":-2},{"$f":"K363-2","v":-2},{"$f":"N363-2","v":-2},{"$f":"Q363-2","v":-2}]
[null,"2023-04-07",null,null,6.8,null,null,6.69,null,null,6.09,null,null,4.4000000000000004,null,null,3.45,null,null,null,{"$f":"E364-2","v":4.8},{"$f":"H364-2","v":4.6900000000000004},{"$f":"K364-2","v":4.09},{"$f":"N364-2","v":2.4000000000000004},{"$f":"Q364-2","v":1.4500000000000002}]
[null,"DIFERENÇA(mm)",null,null,4.95,null,null,4.6900000000000004,null,null,4.25,null,null,2.42,null,null,1.5099999999999998,null,null,"Max",{"$f":"MAX(U361:U364)","v":4.95},{"$f":"MAX(V361:V364)","v":4.6900000000000004},{"$f":"MAX(W361:W364)","v":4.25},{"$f":"MAX(X361:X364)","v":2.42},{"$f":"MAX(Y361:Y364)","v":1.5099999999999998}]
[null,"EXPANSÃO (%)",null,null,4.3411499999999998,null,null,4.11313,null,null,3.7272500000000002,null,null,2.1223399999999999,null,null,1.3242699999999998,null,null,"Min",{"$f":"MIN(U361:U364)","v":-2},{"$f":"MIN(V361:V364)","v":-2},{"$f":"MIN(W361:W364)","v":-2},{"$f":"MIN(X361:X364)","v":-2},{"$f":"MIN(Y361:Y364)","v":-2}]
[null,null,null,null,null,null,null,null,null,null,null,null,null,null,null,null,null,null,null,"Exp"]
[]
[]
[]
[]
[]
[]
[]
[]
[]
[]
[]
[]
[]
[]
[]
[]
[]
[null,"Belo Horizonte, 17 de abril de 2023.",null,null,null,null,null,null,null,null,null,"Operador:",null,"Igor"]
[null,null,null,null,null,null,null,null,null,null,null,"Verificador:",null,"DLFF"]
[]
[null,"Nota: A repetição deste ensaio estará sujeita a aprovação prévia e por escrito da contratante."]

{"sheet":"SCS - Dispersão","index":2,"n_rows":131,"n_cols":35,"rows_kept":131,"cut":false,"hidden":true,"merged":[[3,3,5,6],[3,7,5,10],[3,11,4,18],[5,11,5,18],[6,17,6,18],[7,11,7,16],[7,17,7,18],[15,2,15,9],[17,6,17,12],[18,9,18,10],[18,17,18,18],[19,1,20,8],[19,9,20,18],[8,17,8,18],[9,11,9,16],[9,17,9,18],[11,1,12,18],[13,2,13,9],[14,2,14,9],[21,1,21,2],[21,3,21,4],[21,5,21,6],[21,7,21,8],[21,9,22,16],[21,17,22,18],[22,1,22,2],[22,3,22,4],[22,5,22,6],[22,7,22,8],[23,13,24,14],[23,15,24,16],[23,17,24,18],[24,1,24,2],[24,3,24,4],[24,5,24,6],[24,7,24,8],[23,1,23,2],[23,3,23,4],[23,5,23,6],[23,7,23,8],[23,9,24,10],[23,11,24,12],[25,13,25,14],[25,15,25,16],[25,17,25,18],[26,1,26,2],[26,3,26,4],[26,5,26,6],[26,7,26,8],[26,9,26,10],[26,11,26,12],[26,13,26,14],[25,1,25,2],[25,3,25,4],[25,5,25,6],[25,7,25,8],[25,9,25,10],[25,11,25,12],[27,17,27,18],[28,1,28,2],[28,3,28,8],[28,9,28,10],[28,11,28,12],[28,13,28,14],[28,15,28,16],[28,17,28,18],[26,15,26,16],[26,17,26,18],[27,1,27,2],[27,3,27,4],[27,5,27,6],[27,7,27,8],[27,9,27,10],[27,11,27,12],[27,13,27,14],[27,15,27,16],[30,32,30,33],[31,9,31,10],[31,11,31,12],[31,13,31,14],[31,15,31,16],[31,17,31,18],[31,31,33,31],[31,32,31,33],[30,1,31,8],[30,9,30,10],[30,11,30,12],[30,13,30,14],[30,15,30,16],[30,17,30,18],[28,31,30,31],[28,32,28,33],[29,1,29,6],[29,7,29,8],[29,9,29,10],[29,11,29,12],[29,13,29,14],[29,15,29,16],[29,17,29,18],[29,32,29,33],[32,7,32,8],[32,9,33,18],[32,32,32,33],[33,7,33,8],[33,32,33,33],[34,7,34,8],[34,9,35,16],[34,17,35,18],[34,31,36,31],[34,32,34,33],[35,7,35,8],[35,32,35,33],[36,1,37,8],[36,9,37,10],[36,11,37,12],[36,13,37,14],[36,15,37,16],[36,17,37,18],[36,32,36,33],[38,31,38,47],[39,7,39,8],[39,9,39,10],[39,11,39,12],[39,13,39,14],[39,15,39,16],[39,17,39,18],[39,31,39,32],[39,33,40,35],[39,36,40,38],[38,7,38,8],[38,9,38,10],[38,11,38,12],[38,13,38,14],[38,15,38,16],[38,17,38,18],[40,49,40,53],[41,7,41,8],[41,9,41,10],[41,11,41,12],[41,13,41,14],[41,15,41,16],[41,17,41,18],[41,31,41,32],[41,33,41,35],[41,36,41,38],[39,39,40,41],[39,42,40,44],[39,45,40,47],[40,7,40,8],[40,9,40,10],[40,11,40,12],[40,13,40,14],[40,15,40,16],[40,17,40,18],[40,31,40,32],[41,39,41,41],[41,42,41,44],[41,45,41,47],[42,7,42,8],[42,9,42,10],[42,11,42,12],[42,13,42,14],[42,15,42,16],[42,17,42,18],[42,31,42,32],[45,45,45,47],[45,1,45,2],[45,3,45,4],[45,5,45,6],[45,7,45,8],[45,11,45,12],[45,13,45,15],[43,31,43,32],[44,7,44,8],[44,9,44,10],[44,11,44,12],[44,13,44,14],[44,15,44,16],[44,17,44,18],[44,31,44,32],[43,7,43,8],[43,9,43,10],[43,11,43,12],[43,13,43,14],[43,15,43,16],[43,17,43,18],[46,5,46,6],[46,7,46,8],[46,9,46,10],[46,11,46,12],[45,31,45,32],[45,33,45,35],[45,36,45,38],[45,39,45,41],[45,42,45,44],[48,3,48,4],[48,5,48,6],[48,7,48,8],[48,9,48,10],[48,11,48,12],[48,13,48,15],[46,45,46,47],[47,1,47,2],[47,3,47,4],[47,5,47,6],[47,7,47,8],[47,9,47,10],[47,11,47,12],[47,13,47,15],[47,32,55,46],[48,1,48,2],[46,13,46,15],[46,31,46,32],[46,33,46,35],[46,36,46,38],[46,39,46,41],[46,42,46,44],[46,1,46,2],[46,3,46,4],[49,13,49,15],[50,1,50,2],[50,3,50,4],[50,5,50,6],[50,7,50,8],[50,9,50,10],[50,11,50,12],[50,13,50,15],[49,1,49,2],[49,3,49,4],[49,5,49,6],[49,7,49,8],[49,9,49,10],[49,11,49,12],[51,13,51,15],[52,1,52,2],[52,3,52,4],[52,5,52,6],[52,7,52,8],[52,9,52,10],[52,11,52,12],[52,13,52,15],[51,1,51,2],[51,3,51,4],[51,5,51,6],[51,7,51,8],[51,9,51,10],[51,11,51,12],[53,13,53,15],[54,1,54,2],[54,3,54,4],[54,5,54,6],[54,7,54,8],[54,9,54,10],[54,11,54,12],[54,13,54,15],[53,1,53,2],[53,3,53,4],[53,5,53,6],[53,7,53,8],[53,9,53,10],[53,11,53,12],[55,13,55,15],[56,1,56,2],[56,3,56,4],[56,5,56,6],[56,7,56,8],[56,9,56,10],[56,11,56,12],[56,13,56,15],[55,1,55,2],[55,3,55,4],[55,5,55,6],[55,7,55,8],[55,9,55,10],[55,11,55,12],[62,38,62,40],[63,31,63,34],[63,38,63,40],[63,41,63,42],[64,31,64,32],[64,33,64,36],[64,41,65,47],[57,13,57,15],[58,1,58,2],[58,3,58,4],[58,5,58,6],[58,7,58,8],[58,9,58,10],[58,11,58,12],[58,13,58,15],[57,1,57,2],[57,3,57,4],[57,5,57,6],[57,7,57,8],[57,9,57,10],[57,11,57,12],[62,13,62,14],[70,11,70,16],[70,17,70,18],[71,11,71,16],[71,17,71,18],[72,11,72,16],[72,17,72,18],[65,1,65,18],[66,3,68,6],[66,7,68,10],[66,11,67,18],[68,11,68,18],[69,11,69,16],[69,17,69,18],[81,9,81,10],[81,17,81,18],[82,1,99,18],[100,1,100,3],[100,4,100,7],[100,9,100,13],[100,14,100,18],[74,1,75,18],[76,2,76,9],[77,2,77,9],[78,2,78,9],[79,2,79,9],[80,6,80,12],[103,1,103,3],[103,4,103,7],[103,9,103,13],[103,14,103,18],[104,1,104,3],[104,4,104,7],[104,9,104,13],[104,14,104,18],[101,1,101,3],[101,4,101,7],[101,9,101,13],[101,14,101,18],[102,1,102,3],[102,4,102,7],[102,9,102,13],[102,14,102,18],[107,1,107,3],[107,4,107,7],[107,9,107,13],[107,14,107,18],[108,1,108,3],[108,4,108,18],[105,1,105,3],[105,4,105,7],[105,9,105,13],[105,14,105,18],[106,1,106,3],[106,4,106,7],[106,9,106,13],[106,14,106,18],[127,1,127,6],[128,1,128,6],[130,1,130,18],[109,1,109,3],[109,4,109,8],[109,9,109,13],[109,14,109,18],[110,1,110,3],[110,4,110,8],[110,9,110,13],[110,14,110,18],[111,1,112,18],[113,1,114,6],[113,7,114,18]]}
[]
[]
[]
[null,null,null,null,null,null,null,"CLASSIFICAÇÃO                                                                                                                                                                 USO INTERNO",null,null,null,{"$f":"CARACTERIZAÇÃO!$L$4","v":"PROJETO DE PAVIMENTAÇÃO"}]
[]
[null,null,null,null,null,null,null,null,null,null,null,{"$f":"CARACTERIZAÇÃO!$L$6","v":"BELAGIO"}]
[null,{"$f":"CARACTERIZAÇÃO!$B$7","v":"PREFEITURA MUNICIPAL DE NOVA LIMA"},null,null,null,null,null,null,null,null,null,"Nº VALE",null,null,null,null,null,"PÁGINA"]
[null,{"$f":"CARACTERIZAÇÃO!$B$8","v":"PROJETO DE INFRAESTRUTURA"},null,null,null,null,null,null,null,null,null,{"$f":"CARACTERIZAÇÃO!$L$8","v":"-"},null,null,null,null,null,"5/ 6"]
[null,{"$f":"CARACTERIZAÇÃO!$B$9","v":"ENSAIOS GEOTÉCNICOS DE LABORATÓRIO"},null,null,null,null,null,null,null,null,null,"Nº (CONTRATADA)",null,null,null,null,null,"REV.",null,{"$f":"(100/(100+D29))","v":{"$error":"#N/A"}}]
[null,{"$f":"CARACTERIZAÇÃO!$B$10","v":"RELATÓRIO TÉCNICO"},null,null,null,null,null,null,null,null,null,{"$f":"CARACTERIZAÇÃO!$L$10","v":"SND-PNL-030-RTE-04723-REVA"},null,null,null,null,null,{"$f":"CARACTERIZAÇÃO!$R$10","v":"A"}]
[]
[null,"ENSAIO DE DISPERSÃO - SCS                                                                                                                                                                                                                    ABNT NBR 13602/ 2020"]
[]
[null,"Cliente:",{"$f":"VLOOKUP(O14,'[1]Livro de Registro'!$A:$B,2,0)","v":"Prefeitura Municipal de Nova Lima"},null,null,null,null,null,null,null,null,"Registro:",null,null,{"$f":"CARACTERIZAÇÃO!O14","v":"0565"}]
[null,"Obra:",{"$f":"VLOOKUP(O14,'[1]Livro de Registro'!$A:$C,3,0)","v":"Pavimentação"},null,null,null,null,null,null,null,null,"Furo:",null,null,{"$f":"VLOOKUP(O14,'[1]Livro de Registro'!$A:$G,7,0)","v":"ST-02"}]
[null,"Local:",{"$f":"VLOOKUP(O14,'[1]Livro de Registro'!$A:$D,4,0)","v":"Belagio"},null,null,null,null,null,null,null,null,"Profundidade:",null,null,{"$f":"VLOOKUP(O14,'[1]Livro de Registro'!$A:$I,9,0)","v":"0,15 a 0,60 m"}]
[null,"Material:",null,null,null,null,null,null,null,null,null,"Coordenadas:",null,null,{"$f":"VLOOKUP(O14,'[1]Livro de Registro'!$A:$H,8,0)","v":0}]
[null,null,null,null,null,null,"EQUIPAMENTOS"]
[null,"Balança (n°):",{"$f":"CARACTERIZAÇÃO!$C$19","v":"BLÇ-001"},null,null,null,null,null,"Estufa (n°):",{"$f":"CARACTERIZAÇÃO!$J$19","v":"ET-002"},null,null,null,null,null,null,"Termômetro (n°):",{"$f":"CARACTERIZAÇÃO!$R$19","v":"TRM-007"}]
[null,"TEOR DE UMIDADE                                                                                                              ABNT 6457",null,null,null,null,null,null,null,"PENEIRAMENTO GRAÚDO                                                                                          ABNT 7181"]
[]
[null,"CAPSULA (n°):",null,null,null,null,null,null,null,"RECIPIENTE (n°):",null,null,null,null,null,null,null,{"$f":"CARACTERIZAÇÃO!R22","v":"G-27"}]
[null,"CAPSULA + SOLO ÚMIDO (g):"]
[null,"CAPSULA + SOLO SECO (g):",null,null,null,null,null,null,null,"PENEIRA (n°):",null,"ABERTURA (mm):",null,"PESO RETIDO (g):",null,"PESO RETIDO ACUMULADO (g):",null,"% DA AMOSTRA QUE PASSA (%):"]
[null,"TARA DA CAPSULA (g):",null,{"$f":"VLOOKUP(D22,TABELAS!$A:$B,2,FALSE)","v":{"$error":"#N/A"}},null,{"$f":"VLOOKUP(F22,TABELAS!$A:$B,2,FALSE)","v":{"$error":"#N/A"}},null,{"$f":"VLOOKUP(H22,TABELAS!$A:$B,2,FALSE)","v":{"$error":"#N/A"}}]
[null,"PESO DE ÁGUA (g):",null,{"$f":"D23-D24","v":0},null,{"$f":"F23-F24","v":0},null,{"$f":"H23-H24","v":0},null,"2\"",null,50,null,{"$f":"CARACTERIZAÇÃO!N26","v":0},null,{"$f":"N26","v":0},null,{"$f":"100-(P26/$H$34*100)","v":{"$error":"#N/A"}}]
[null,"PESO DE SOLO SECO (g):",null,{"$f":"D24-D25","v":{"$error":"#N/A"}},null,{"$f":"F24-F25","v":{"$error":"#N/A"}},null,{"$f":"H24-H25","v":{"$error":"#N/A"}},null,"1 1/2\"",null,38,null,{"$f":"CARACTERIZAÇÃO!N27","v":0},null,{"$f":"N27+P26","v":0},null,{"$f":"100-(P27/$H$34*100)","v":{"$error":"#N/A"}}]
[null,"TEOR DE UMIDADE (%):",null,{"$f":"(D26/D27)*100","v":{"$error":"#N/A"}},null,{"$f":"(F26/F27)*100","v":{"$error":"#N/A"}},null,{"$f":"(H26/H27)*100","v":{"$error":"#N/A"}},null,"1\"",null,25,null,{"$f":"CARACTERIZAÇÃO!N28","v":141.1},null,141.1,null,{"$error":"#N/A"}]
[null,"TEOR MÉDIO (%):",null,{"$f":"AVERAGE(D28:I28)","v":{"$error":"#N/A"}},null,null,null,null,null,"3/4\"",null,19,null,{"$f":"CARACTERIZAÇÃO!N29","v":103.78},null,244.88,null,{"$error":"#N/A"}]
[null,"TEMPERATURA (°C):",null,null,null,null,null,null,null,"3/8\"",null,9.5,null,{"$f":"CARACTERIZAÇÃO!N30","v":298.8},null,543.68000000000006,null,{"$error":"#N/A"}]
[null,"AMOSTRA TOTAL",null,null,null,null,null,null,null,4,null,4.8,null,{"$f":"CARACTERIZAÇÃO!N31","v":262.17},null,805.85000000000014,null,{"$error":"#N/A"}]
[null,null,null,null,null,null,null,null,null,10,null,2,null,{"$f":"CARACTERIZAÇÃO!N32","v":270.83},null,1076.68,null,{"$error":"#N/A"}]
[null,"AMOSTRA TOTAL ÚMIDA (g):",null,null,null,null,null,{"$f":"CARACTERIZAÇÃO!H33","v":3772},null,"PENEIRAMENTO FINO                                                                                                                                                  ABNT 7181"]
[null,"AMOSTRA TOTAL SECA (g):",null,null,null,null,null,{"$f":"H35+H36","v":{"$error":"#N/A"}}]
[null,"RETIDO NA PENEIRA (2mm) n°10 (g):",null,null,null,null,null,{"$f":"P32","v":1076.68},null,"RECIPIENTE (n°):"]
[null,"PASSADO NA PENEIRA (2mm) n°10 (g):",null,null,null,null,null,{"$f":"(H33-H35)*T9","v":{"$error":"#N/A"}}]
[null,"SEDIMENTAÇÃO                                                                                                  ABNT NBR 13602:2020",null,null,null,null,null,null,null,"PENEIRA (n°):",null,"ABERTURA (mm):",null,"PESO RETIDO (g):",null,"PESO RETIDO ACUMULADO (g):",null,"% DA AMOSTRA QUE PASSA (%):"]
[]
[null,"DEFLOCULANTE:",null,null,null,null,null,"ÁGUA",null,16,null,1.2,null,null,null,{"$f":"N39","v":0},null,{"$f":"(($H$44-P39)/$H$44*$R$32)","v":{"$error":"#N/A"}}]
[null,"PICNÔMETRO (n°):",null,null,null,null,null,null,null,30,null,0.6,null,null,null,{"$f":"N40+P39","v":0},null,{"$f":"(($H$44-P40)/$H$44*$R$32)","v":{"$error":"#N/A"}}]
[null,"DENSIMETRO (n°):",null,null,null,null,null,null,null,40,null,0.42,null,null,null,0,null,{"$error":"#N/A"}]
[null,"PROVETA (n°):",null,null,null,null,null,null,null,50,null,0.3,null,null,null,0,null,{"$error":"#N/A"}]
[null,"PESO AMOSTRA ÚMIDA (g):",null,null,null,null,null,null,null,60,null,0.25,null,null,null,0,null,{"$error":"#N/A"}]
[null,"PESO AMOSTRA SECA (g):",null,null,null,null,null,{"$f":"H43/(100+D29)*100","v":{"$error":"#N/A"}},null,100,null,0.15,null,null,null,0,null,{"$error":"#N/A"},null,15]
[null,"DENSIDADE DOS GRÃOS d (g/cm3):",null,null,null,null,null,{"$f":"CARACTERIZAÇÃO!R116","v":2.8896530890268872},null,200,null,7.4999999999999997E-2,null,null,null,0,null,{"$error":"#N/A"},null,30]
[null,"Hora",null,"Dt",null,"Leitura - L",null,"T (oC)",null,"Diâmetro dos Grãos (mm)",null,"Correção - CI",null,"Leit. Corrigida - Lc",null,null,"(%) Finos Totais",null,null,60]
[null,null,null,"15\"",null,null,null,null,null,{"$f":"IF($H$41=1,(SQRT(1800*VLOOKUP(H47,TABELAS!$M:$N,2,FALSE)/($H$45-1))*(SQRT(VLOOKUP(F47,CALCULOS!$F:$L,2,FALSE)/T44))),IF($H$41=2,(SQRT(1800*VLOOKUP(H47,TABELAS!$M:$N,2,FALSE)/($H$45-1))*(SQRT(VLOOKUP(F47,CALCULOS!$AJ$3:$AL$224,2,FALSE)/T44))),IF($H$41=3,(SQRT(1800*VLOOKUP(H47,TABELAS!$M:$N,2,FALSE)/($H$45-1))*(SQRT(VLOOKUP(F47,CALCULOS!$F:$L,6,FALSE)/T44))))))","v":false},null,{"$f":"(IF(AND(COUNTBLANK(H47)=0,COUNTBLANK($H$41)=0),IF($H$41=1,VLOOKUP(H47,CALCULOS!$A:$D,2,FALSE),IF($H$41=2,VLOOKUP(H47,CALCULOS!$AM$3:$AN$274,2,FALSE),IF($H$41=3,VLOOKUP(H47,CALCULOS!$A:$D,4,FALSE)))),\" \"))","v":" "},null,{"$f":"ROUND(F47-1000+L47+1000,2)","v":{"$error":"#VALUE!"}},null,null,{"$f":"ROUND(($H$45/($H$45-1))*$R$32*((N47-1000)/($H$44)),1)","v":{"$error":"#N/A"}},null,null,120]
[null,{"$f":"$B$47+(T45/86400)","v":"00:00:30"},null,"30\"",null,null,null,null,null,{"$f":"IF($H$41=1,(SQRT(1800*VLOOKUP(H48,TABELAS!$M:$N,2,FALSE)/($H$45-1))*(SQRT(VLOOKUP(F48,CALCULOS!$F:$L,2,FALSE)/T45))),IF($H$41=2,(SQRT(1800*VLOOKUP(H48,TABELAS!$M:$N,2,FALSE)/($H$45-1))*(SQRT(VLOOKUP(F48,CALCULOS!$AJ$3:$AL$224,2,FALSE)/T45))),IF($H$41=3,(SQRT(1800*VLOOKUP(H48,TABELAS!$M:$N,2,FALSE)/($H$45-1))*(SQRT(VLOOKUP(F48,CALCULOS!$F:$L,6,FALSE)/T45))))))","v":false},null,{"$f":"(IF(AND(COUNTBLANK(H48)=0,COUNTBLANK($H$41)=0),IF($H$41=1,VLOOKUP(H48,CALCULOS!$A:$D,2,FALSE),IF($H$41=2,VLOOKUP(H48,CALCULOS!$AM$3:$AN$274,2,FALSE),IF($H$41=3,VLOOKUP(H48,CALCULOS!$A:$D,4,FALSE)))),\" \"))","v":" "},null,{"$f":"ROUND(F48-1000+L48+1000,2)","v":{"$error":"#VALUE!"}},null,null,{"$f":"ROUND(($H$45/($H$45-1))*$R$32*((N48-1000)/($H$44)),1)","v":{"$error":"#N/A"}},null,null,240]
[null,{"$f":"$B$47+(T46/86400)","v":"00:01:00"},null,"60\"",null,null,null,null,null,{"$f":"IF($H$41=1,(SQRT(1800*VLOOKUP(H49,TABELAS!$M:$N,2,FALSE)/($H$45-1))*(SQRT(VLOOKUP(F49,CALCULOS!$F:$L,2,FALSE)/T46))),IF($H$41=2,(SQRT(1800*VLOOKUP(H49,TABELAS!$M:$N,2,FALSE)/($H$45-1))*(SQRT(VLOOKUP(F49,CALCULOS!$AJ$3:$AL$224,2,FALSE)/T46))),IF($H$41=3,(SQRT(1800*VLOOKUP(H49,TABELAS!$M:$N,2,FALSE)/($H$45-1))*(SQRT(VLOOKUP(F49,CALCULOS!$F:$L,6,FALSE)/T46))))))","v":false},null,{"$f":"(IF(AND(COUNTBLANK(H49)=0,COUNTBLANK($H$41)=0),IF($H$41=1,VLOOKUP(H49,CALCULOS!$A:$D,2,FALSE),IF($H$41=2,VLOOKUP(H49,CALCULOS!$AM$3:$AN$274,2,FALSE),IF($H$41=3,VLOOKUP(H49,CALCULOS!$A:$D,4,FALSE)))),\" \"))","v":" "},null,{"$error":"#VALUE!"},null,null,{"$error":"#N/A"},null,null,480]
[null,"00:02:00",null,"2'",null,null,null,null,null,{"$f":"IF($H$41=1,(SQRT(1800*VLOOKUP(H50,TABELAS!$M:$N,2,FALSE)/($H$45-1))*(SQRT(VLOOKUP(F50,CALCULOS!$F:$L,2,FALSE)/T47))),IF($H$41=2,(SQRT(1800*VLOOKUP(H50,TABELAS!$M:$N,2,FALSE)/($H$45-1))*(SQRT(VLOOKUP(F50,CALCULOS!$AJ$3:$AL$224,2,FALSE)/T47))),IF($H$41=3,(SQRT(1800*VLOOKUP(H50,TABELAS!$M:$N,2,FALSE)/($H$45-1))*(SQRT(VLOOKUP(F50,CALCULOS!$F:$L,6,FALSE)/T47))))))","v":false},null,{"$f":"(IF(AND(COUNTBLANK(H50)=0,COUNTBLANK($H$41)=0),IF($H$41=1,VLOOKUP(H50,CALCULOS!$A:$D,2,FALSE),IF($H$41=2,VLOOKUP(H50,CALCULOS!$AM$3:$AN$274,2,FALSE),IF($H$41=3,VLOOKUP(H50,CALCULOS!$A:$D,4,FALSE)))),\" \"))","v":" "},null,{"$error":"#VALUE!"},null,null,{"$error":"#N/A"},null,null,900]
[null,"00:04:00",null,"4'",null,null,null,null,null,{"$f":"IF($H$41=1,(SQRT(1800*VLOOKUP(H51,TABELAS!$M:$N,2,FALSE)/($H$45-1))*(SQRT(VLOOKUP(F51,CALCULOS!$F:$L,2,FALSE)/T48))),IF($H$41=2,(SQRT(1800*VLOOKUP(H51,TABELAS!$M:$N,2,FALSE)/($H$45-1))*(SQRT(VLOOKUP(F51,CALCULOS!$AJ$3:$AL$224,3,FALSE)/T48))),IF($H$41=3,(SQRT(1800*VLOOKUP(H51,TABELAS!$M:$N,2,FALSE)/($H$45-1))*(SQRT(VLOOKUP(F51,CALCULOS!$F:$L,7,FALSE)/T48))))))","v":false},null,{"$f":"(IF(AND(COUNTBLANK(H51)=0,COUNTBLANK($H$41)=0),IF($H$41=1,VLOOKUP(H51,CALCULOS!$A:$D,2,FALSE),IF($H$41=2,VLOOKUP(H51,CALCULOS!$AM$3:$AN$274,2,FALSE),IF($H$41=3,VLOOKUP(H51,CALCULOS!$A:$D,4,FALSE)))),\" \"))","v":" "},null,{"$error":"#VALUE!"},null,null,{"$error":"#N/A"},null,null,1800]
[null,"00:08:00",null,"8'",null,null,null,null,null,{"$f":"IF($H$41=1,(SQRT(1800*VLOOKUP(H52,TABELAS!$M:$N,2,FALSE)/($H$45-1))*(SQRT(VLOOKUP(F52,CALCULOS!$F:$L,2,FALSE)/T49))),IF($H$41=2,(SQRT(1800*VLOOKUP(H52,TABELAS!$M:$N,2,FALSE)/($H$45-1))*(SQRT(VLOOKUP(F52,CALCULOS!$AJ$3:$AL$224,3,FALSE)/T49))),IF($H$41=3,(SQRT(1800*VLOOKUP(H52,TABELAS!$M:$N,2,FALSE)/($H$45-1))*(SQRT(VLOOKUP(F52,CALCULOS!$F:$L,7,FALSE)/T49))))))","v":false},null,{"$f":"(IF(AND(COUNTBLANK(H52)=0,COUNTBLANK($H$41)=0),IF($H$41=1,VLOOKUP(H52,CALCULOS!$A:$D,2,FALSE),IF($H$41=2,VLOOKUP(H52,CALCULOS!$AM$3:$AN$274,2,FALSE),IF($H$41=3,VLOOKUP(H52,CALCULOS!$A:$D,4,FALSE)))),\" \"))","v":" "},null,{"$error":"#VALUE!"},null,null,{"$error":"#N/A"},null,null,3600]
[null,"00:15:00",null,"15'",null,null,null,null,null,{"$f":"IF($H$41=1,(SQRT(1800*VLOOKUP(H53,TABELAS!$M:$N,2,FALSE)/($H$45-1))*(SQRT(VLOOKUP(F53,CALCULOS!$F:$L,2,FALSE)/T50))),IF($H$41=2,(SQRT(1800*VLOOKUP(H53,TABELAS!$M:$N,2,FALSE)/($H$45-1))*(SQRT(VLOOKUP(F53,CALCULOS!$AJ$3:$AL$224,3,FALSE)/T50))),IF($H$41=3,(SQRT(1800*VLOOKUP(H53,TABELAS!$M:$N,2,FALSE)/($H$45-1))*(SQRT(VLOOKUP(F53,CALCULOS!$F:$L,7,FALSE)/T50))))))","v":false},null,{"$f":"(IF(AND(COUNTBLANK(H53)=0,COUNTBLANK($H$41)=0),IF($H$41=1,VLOOKUP(H53,CALCULOS!$A:$D,2,FALSE),IF($H$41=2,VLOOKUP(H53,CALCULOS!$AM$3:$AN$274,2,FALSE),IF($H$41=3,VLOOKUP(H53,CALCULOS!$A:$D,4,FALSE)))),\" \"))","v":" "},null,{"$error":"#VALUE!"},null,null,{"$error":"#N/A"},null,null,7200]
[null,"00:30:00",null,"30'",null,null,null,null,null,{"$f":"IF($H$41=1,(SQRT(1800*VLOOKUP(H54,TABELAS!$M:$N,2,FALSE)/($H$45-1))*(SQRT(VLOOKUP(F54,CALCULOS!$F:$L,2,FALSE)/T51))),IF($H$41=2,(SQRT(1800*VLOOKUP(H54,TABELAS!$M:$N,2,FALSE)/($H$45-1))*(SQRT(VLOOKUP(F54,CALCULOS!$AJ$3:$AL$224,3,FALSE)/T51))),IF($H$41=3,(SQRT(1800*VLOOKUP(H54,TABELAS!$M:$N,2,FALSE)/($H$45-1))*(SQRT(VLOOKUP(F54,CALCULOS!$F:$L,7,FALSE)/T51))))))","v":false},null,{"$f":"(IF(AND(COUNTBLANK(H54)=0,COUNTBLANK($H$41)=0),IF($H$41=1,VLOOKUP(H54,CALCULOS!$A:$D,2,FALSE),IF($H$41=2,VLOOKUP(H54,CALCULOS!$AM$3:$AN$274,2,FALSE),IF($H$41=3,VLOOKUP(H54,CALCULOS!$A:$D,4,FALSE)))),\" \"))","v":" "},null,{"$error":"#VALUE!"},null,null,{"$error":"#N/A"},null,null,14400]
[null,"01:00:00",null,"1h",null,null,null,null,null,{"$f":"IF($H$41=1,(SQRT(1800*VLOOKUP(H55,TABELAS!$M:$N,2,FALSE)/($H$45-1))*(SQRT(VLOOKUP(F55,CALCULOS!$F:$L,2,FALSE)/T52))),IF($H$41=2,(SQRT(1800*VLOOKUP(H55,TABELAS!$M:$N,2,FALSE)/($H$45-1))*(SQRT(VLOOKUP(F55,CALCULOS!$AJ$3:$AL$224,3,FALSE)/T52))),IF($H$41=3,(SQRT(1800*VLOOKUP(H55,TABELAS!$M:$N,2,FALSE)/($H$45-1))*(SQRT(VLOOKUP(F55,CALCULOS!$F:$L,7,FALSE)/T52))))))","v":false},null,{"$f":"(IF(AND(COUNTBLANK(H55)=0,COUNTBLANK($H$41)=0),IF($H$41=1,VLOOKUP(H55,CALCULOS!$A:$D,2,FALSE),IF($H$41=2,VLOOKUP(H55,CALCULOS!$AM$3:$AN$274,2,FALSE),IF($H$41=3,VLOOKUP(H55,CALCULOS!$A:$D,4,FALSE)))),\" \"))","v":" "},null,{"$error":"#VALUE!"},null,null,{"$error":"#N/A"},null,null,28800]
[null,"02:00:00",null,"2h",null,null,null,null,null,{"$f":"IF($H$41=1,(SQRT(1800*VLOOKUP(H56,TABELAS!$M:$N,2,FALSE)/($H$45-1))*(SQRT(VLOOKUP(F56,CALCULOS!$F:$L,2,FALSE)/T53))),IF($H$41=2,(SQRT(1800*VLOOKUP(H56,TABELAS!$M:$N,2,FALSE)/($H$45-1))*(SQRT(VLOOKUP(F56,CALCULOS!$AJ$3:$AL$224,3,FALSE)/T53))),IF($H$41=3,(SQRT(1800*VLOOKUP(H56,TABELAS!$M:$N,2,FALSE)/($H$45-1))*(SQRT(VLOOKUP(F56,CALCULOS!$F:$L,7,FALSE)/T53))))))","v":false},null,{"$f":"(IF(AND(COUNTBLANK(H56)=0,COUNTBLANK($H$41)=0),IF($H$41=1,VLOOKUP(H56,CALCULOS!$A:$D,2,FALSE),IF($H$41=2,VLOOKUP(H56,CALCULOS!$AM$3:$AN$274,2,FALSE),IF($H$41=3,VLOOKUP(H56,CALCULOS!$A:$D,4,FALSE)))),\" \"))","v":" "},null,{"$error":"#VALUE!"},null,null,{"$error":"#N/A"},null,null,86400]
[null,"04:00:00",null,"4h",null,null,null,null,null,{"$f":"IF($H$41=1,(SQRT(1800*VLOOKUP(H57,TABELAS!$M:$N,2,FALSE)/($H$45-1))*(SQRT(VLOOKUP(F57,CALCULOS!$F:$L,2,FALSE)/T54))),IF($H$41=2,(SQRT(1800*VLOOKUP(H57,TABELAS!$M:$N,2,FALSE)/($H$45-1))*(SQRT(VLOOKUP(F57,CALCULOS!$AJ$3:$AL$224,3,FALSE)/T54))),IF($H$41=3,(SQRT(1800*VLOOKUP(H57,TABELAS!$M:$N,2,FALSE)/($H$45-1))*(SQRT(VLOOKUP(F57,CALCULOS!$F:$L,7,FALSE)/T54))))))","v":false},null,{"$f":"(IF(AND(COUNTBLANK(H57)=0,COUNTBLANK($H$41)=0),IF($H$41=1,VLOOKUP(H57,CALCULOS!$A:$D,2,FALSE),IF($H$41=2,VLOOKUP(H57,CALCULOS!$AM$3:$AN$274,2,FALSE),IF($H$41=3,VLOOKUP(H57,CALCULOS!$A:$D,4,FALSE)))),\" \"))","v":" "},null,{"$error":"#VALUE!"},null,null,{"$error":"#N/A"}]
[null,"08:00:00",null,"8h",null,null,null,null,null,{"$f":"IF($H$41=1,(SQRT(1800*VLOOKUP(H58,TABELAS!$M:$N,2,FALSE)/($H$45-1))*(SQRT(VLOOKUP(F58,CALCULOS!$F:$L,2,FALSE)/T55))),IF($H$41=2,(SQRT(1800*VLOOKUP(H58,TABELAS!$M:$N,2,FALSE)/($H$45-1))*(SQRT(VLOOKUP(F58,CALCULOS!$AJ$3:$AL$224,3,FALSE)/T55))),IF($H$41=3,(SQRT(1800*VLOOKUP(H58,TABELAS!$M:$N,2,FALSE)/($H$45-1))*(SQRT(VLOOKUP(F58,CALCULOS!$F:$L,7,FALSE)/T55))))))","v":false},null,{"$f":"(IF(AND(COUNTBLANK(H58)=0,COUNTBLANK($H$41)=0),IF($H$41=1,VLOOKUP(H58,CALCULOS!$A:$D,2,FALSE),IF($H$41=2,VLOOKUP(H58,CALCULOS!$AM$3:$AN$274,2,FALSE),IF($H$41=3,VLOOKUP(H58,CALCULOS!$A:$D,4,FALSE)))),\" \"))","v":" "},null,{"$error":"#VALUE!"},null,null,{"$error":"#N/A"}]
[null,1,null,"24h",null,null,null,null,null,{"$f":"IF($H$41=1,(SQRT(1800*VLOOKUP(H59,TABELAS!$M:$N,2,FALSE)/($H$45-1))*(SQRT(VLOOKUP(F59,CALCULOS!$F:$L,2,FALSE)/T56))),IF($H$41=2,(SQRT(1800*VLOOKUP(H59,TABELAS!$M:$N,2,FALSE)/($H$45-1))*(SQRT(VLOOKUP(F59,CALCULOS!$AJ$3:$AL$224,3,FALSE)/T56))),IF($H$41=3,(SQRT(1800*VLOOKUP(H59,TABELAS!$M:$N,2,FALSE)/($H$45-1))*(SQRT(VLOOKUP(F59,CALCULOS!$F:$L,7,FALSE)/T56))))))","v":false},null,{"$f":"(IF(AND(COUNTBLANK(H59)=0,COUNTBLANK($H$41)=0),IF($H$41=1,VLOOKUP(H59,CALCULOS!$A:$D,2,FALSE),IF($H$41=2,VLOOKUP(H59,CALCULOS!$AM$3:$AN$274,2,FALSE),IF($H$41=3,VLOOKUP(H59,CALCULOS!$A:$D,4,FALSE)))),\" \"))","v":" "},null,{"$error":"#VALUE!"},null,null,{"$error":"#N/A"}]
[]
[]
[]
[null,{"$f":"CARACTERIZAÇÃO!B63","v":"Belo Horizonte, 17 de abril de 2023."},null,null,null,null,null,null,null,null,null,"Operador:"]
[null,"Nova Lima - Jardim Canadá",null,null,null,null,null,null,null,null,null,"Verificador:",null,{"$f":"$N$64","v":"DLFF"}]
[]
[null,"Nota: A repetição deste ensaio estará sujeita a aprovação prévia e por escrito da contratante."]
[null,null,null,null,null,null,null,"CLASSIFICAÇÃO                                                                                                                                                                 USO INTERNO",null,null,null,{"$f":"$L$4","v":"PROJETO DE PAVIMENTAÇÃO"}]
[]
[null,null,null,null,null,null,null,null,null,null,null,{"$f":"$L$6","v":"BELAGIO"}]
[null,{"$f":"$B$7","v":"PREFEITURA MUNICIPAL DE NOVA LIMA"},null,null,null,null,null,null,null,null,null,"Nº VALE",null,null,null,null,null,"PÁGINA"]
[null,{"$f":"$B$8","v":"PROJETO DE INFRAESTRUTURA"},null,null,null,null,null,null,null,null,null,{"$f":"$L$8","v":"-"},null,null,null,null,null,"6/ 6"]
[null,{"$f":"$B$9","v":"ENSAIOS GEOTÉCNICOS DE LABORATÓRIO"},null,null,null,null,null,null,null,null,null,"Nº (CONTRATADA)",null,null,null,null,null,"REV."]
[null,{"$f":"$B$10","v":"RELATÓRIO TÉCNICO"},null,null,null,null,null,null,null,null,null,{"$f":"$L$10","v":"SND-PNL-030-RTE-04723-REVA"},null,null,null,null,null,{"$f":"$R$10","v":"A"}]
[]
[null,"ENSAIO DE DISPERSÃO - SCS                                                                                                                                                                                                                    ABNT NBR 13602/ 2020"]
[]
[null,{"$f":"B14","v":"Cliente:"},"Prefeitura Municipal de Nova Lima",null,null,null,null,null,null,null,null,"Registro:",null,null,{"$f":"O14","v":"0565"}]
[null,"Obra:","Pavimentação",null,null,null,null,null,null,null,null,"Furo:",null,null,{"$f":"O15","v":"ST-02"}]
[null,"Local:","Belagio",null,null,null,null,null,null,null,null,"Profundidade:",null,null,{"$f":"O16","v":"0,15 a 0,60 m"},null,null,null,null,null,"2\"",50,null,{"$f":"100-R26","v":{"$error":"#N/A"}}]
[null,"Material:",0,null,null,null,null,null,null,null,null,"Coordenadas:",null,null,{"$f":"O17","v":0},null,null,null,null,null,"1 1/2\"",38,null,{"$f":"R26-R27","v":{"$error":"#N/A"}},{"$f":"se","v":{"$error":"#NAME?"}}]
[null,null,null,null,null,null,"EQUIPAMENTOS"]
[null,"Balança (n°):",{"$f":"C19","v":"BLÇ-001"},null,null,null,null,null,"Estufa (n°):",{"$f":"J19","v":"ET-002"},null,null,null,null,null,null,"Termômetro (n°):",{"$f":"R19","v":"TRM-007"}]
[null,null,null,null,null,null,null,null,null,null,null,null,null,null,null,null,null,null,null,null,"1\"",25,null,{"$f":"R27-R28","v":{"$error":"#N/A"}},null,null,null,null,null,null,null,null,null,{"$f":"L26","v":50},{"$f":"R26","v":{"$error":"#N/A"}}]
[null,null,null,null,null,null,null,null,null,null,null,null,null,null,null,null,null,null,null,null,"3/4\"",19,null,{"$f":"R28-R29","v":{"$error":"#N/A"}},null,null,null,null,null,null,null,null,null,38,{"$error":"#N/A"}]
[null,null,null,null,null,null,null,null,null,null,null,null,null,null,null,null,null,null,null,null,"3/8\"",9.5,null,{"$f":"R29-R30","v":{"$error":"#N/A"}},null,null,null,null,null,null,null,null,null,25,{"$error":"#N/A"}]
[null,null,null,null,null,null,null,null,null,null,null,null,null,null,null,null,null,null,null,null,"No 4",4.8,null,{"$f":"R30-R31","v":{"$error":"#N/A"}},null,null,null,null,null,null,null,null,null,19,{"$error":"#N/A"}]
[null,null,null,null,null,null,null,null,null,null,null,null,null,null,null,null,null,null,null,null,"No 10",2,null,{"$f":"R31-R32","v":{"$error":"#N/A"}},null,null,null,null,null,null,null,null,null,9.5,{"$error":"#N/A"}]
[null,null,null,null,null,null,null,null,null,null,null,null,null,null,null,null,null,null,null,null,null,null,null,null,null,null,null,null,null,null,null,null,null,4.8,{"$error":"#N/A"}]
[null,null,null,null,null,null,null,null,null,null,null,null,null,null,null,null,null,null,null,null,16,1.2,null,{"$f":"R32-R39","v":{"$error":"#N/A"}},null,null,null,null,null,null,null,null,null,2,{"$error":"#N/A"}]
[null,null,null,null,null,null,null,null,null,null,null,null,null,null,null,null,null,null,null,null,30,0.6,null,{"$f":"R39-R40","v":{"$error":"#N/A"}},null,null,null,null,null,null,null,null,null,{"$f":"L39","v":1.2},{"$f":"R39","v":{"$error":"#N/A"}}]
[null,null,null,null,null,null,null,null,null,null,null,null,null,null,null,null,null,null,null,null,40,0.42,null,{"$error":"#N/A"},null,null,null,null,null,null,null,null,null,0.6,{"$error":"#N/A"}]
[null,null,null,null,null,null,null,null,null,null,null,null,null,null,null,null,null,null,null,null,50,0.3,null,{"$error":"#N/A"},null,null,null,null,null,null,null,null,null,0.42,{"$error":"#N/A"}]
[null,null,null,null,null,null,null,null,null,null,null,null,null,null,null,null,null,null,null,null,60,0.25,null,{"$error":"#N/A"},null,null,null,null,null,null,null,null,null,0.3,{"$error":"#N/A"}]
[null,null,null,null,null,null,null,null,null,null,null,null,null,null,null,null,null,null,null,null,100,0.15,null,{"$error":"#N/A"},null,null,null,null,null,null,null,null,null,0.25,{"$error":"#N/A"}]
[null,null,null,null,null,null,null,null,null,null,null,null,null,null,null,null,null,null,null,null,200,7.4999999999999997E-2,null,{"$error":"#N/A"},null,null,null,null,null,null,null,null,null,0.15,{"$error":"#N/A"}]
[null,null,null,null,null,null,null,null,null,null,null,null,null,null,null,null,null,null,null,null,null,null,null,null,null,null,null,null,null,null,null,null,null,7.4999999999999997E-2,{"$error":"#N/A"}]
[null,null,null,null,null,null,null,null,null,null,null,null,null,null,null,null,null,null,null,null,1,{"$f":"J47","v":false},null,{"$f":"IF(V97>0.06,R45-Q47,\"\")","v":{"$error":"#N/A"}},{"$f":"IF(AND(V97<=0.06,V97>0.002),R45-Q47, \" \")","v":" "},{"$f":"IF(V97<=0.002,R45-Q47, \"\")","v":""},null,null,null,null,null,null,null,{"$f":"J47","v":false},{"$f":"Q47","v":{"$error":"#N/A"}}]
[null,null,null,null,null,null,null,null,null,null,null,null,null,null,null,null,null,null,null,null,2,false,null,{"$f":"IF(V98>0.06,Q47-Q48,\"\")","v":{"$error":"#N/A"}},{"$f":"IF(AND(V98<=0.06,V98>0.002),Q47-Q48, \" \")","v":" "},{"$f":"IF(V98<=0.002,Q47-Q48, \"\")","v":""},null,null,null,null,null,null,null,false,{"$error":"#N/A"}]
[null,null,null,null,null,null,null,null,null,null,null,null,null,null,null,null,null,null,null,null,3,false,null,{"$error":"#N/A"}," ","",null,null,null,null,null,null,null,false,{"$error":"#N/A"}]
[null,null,null,null,null,null,null,null,null,null,null,null,null,null,null,null,null,null,null,null,4,false,null,{"$error":"#N/A"}," ","",null,null,null,null,null,null,null,false,{"$error":"#N/A"}]
[null,"Argila",null,null,{"$f":"SUM(Z97:Z109)","v":0},null,null,null,"%","Þ",null,null,null,null,"f < 0,002 mm",null,null,null,null,null,5,false,null,{"$error":"#N/A"}," ","",null,null,null,null,null,null,null,false,{"$error":"#N/A"}]
[null,"Silte",null,null,{"$f":"SUM(Y97:Y109)","v":0},null,null,null,"%","Þ",null,null,null,null,"0,002 mm < f < 0,06 mm",null,null,null,null,null,6,false,null,{"$error":"#N/A"}," ","",null,null,null,null,null,null,null,false,{"$error":"#N/A"}]
[null,"Areia Fina",null,null,{"$f":"SUM(X94:X109)","v":{"$error":"#N/A"}},null,null,null,"%","Þ",null,null,null,null,"0,06 mm < f < 0,2 mm",null,null,null,null,null,7,false,null,{"$error":"#N/A"}," ","",null,null,null,null,null,null,null,false,{"$error":"#N/A"}]
[null,"Areia Média",null,null,{"$f":"SUM(X90:X93)","v":{"$error":"#N/A"}},null,null,null,"%","Þ",null,null,null,null,"0,2 mm < f < 0,6 mm",null,null,null,null,null,8,false,null,{"$error":"#N/A"}," ","",null,null,null,null,null,null,null,false,{"$error":"#N/A"}]
[null,"Areia Grossa",null,null,{"$f":"SUM(X87:X89)","v":{"$error":"#N/A"}},null,null,null,"%","Þ",null,null,null,null,"0,6 mm < f < 2 mm",null,null,null,null,null,9,false,null,{"$error":"#N/A"}," ","",null,null,null,null,null,null,null,false,{"$error":"#N/A"}]
[null,"Pedregulho Fino",null,null,{"$f":"SUM(X86)","v":{"$error":"#N/A"}},null,null,null,"%","Þ",null,null,null,null,"2 mm < f < 6 mm",null,null,null,null,null,10,false,null,{"$error":"#N/A"}," ","",null,null,null,null,null,null,null,false,{"$error":"#N/A"}]
[null,"Pedregulho Médio",null,null,{"$f":"SUM(X84:X85)","v":{"$error":"#N/A"}},null,null,null,"%","Þ",null,null,null,null,"6 mm < f < 20 mm",null,null,null,null,null,11,false,null,{"$error":"#N/A"}," ","",null,null,null,null,null,null,null,false,{"$error":"#N/A"}]
[null,"Pedregulho Grosso",null,null,{"$f":"SUM(X79:X83)","v":{"$error":"#N/A"}},null,null,null,"%","Þ",null,null,null,null,"f > 20 mm",null,null,null,null,null,12,false,null,{"$error":"#N/A"}," ","",null,null,null,null,null,null,null,false,{"$error":"#N/A"}]
[null,"Total",null,null,{"$f":"SUM(E101:G108)","v":{"$error":"#N/A"}},null,null,null,null,null,null,null,null,null,null,null,null,null,null,null,13,false,null,{"$f":"IF(V109>0.06,(Q58-Q59)+Q59,\"\")","v":{"$error":"#N/A"}},{"$f":"IF(AND(V109<=0.06,V109>0.002),(Q58-Q59)+Q59, \" \")","v":" "},{"$f":"IF(V109<=0.002,(Q58-Q59)+Q59, \"\")","v":""},null,null,null,null,null,null,null,false,{"$error":"#N/A"}]
[null,"Argila = ",null,null,{"$f":"E101","v":0},null,null,null,null,"Areia = ",null,null,null,null,{"$f":"SUM(E103:G105)","v":{"$error":"#N/A"}}]
[null,"Silte = ",null,null,{"$f":"E102","v":0},null,null,null,null,"Pedregulho =",null,null,null,null,{"$f":"E108+E107+E106","v":{"$error":"#N/A"}},null,null,null,null,null,null,null,{"$f":"SUM(X79:X95)","v":{"$error":"#N/A"}},null,{"$f":"SUM(X97:X109,Y97:Y109,Z97:Z109)","v":{"$error":"#N/A"}}]
[null,"ENSAIO DE DISPERSÃO - SCS                                                                                                                                                                                                                    ABNT NBR 13602/ 2020"]
[]
[null,"Porcentagem de dispersão [%]:",null,null,null,null,null,{"$f":"(E101/CARACTERIZAÇÃO!E101)*100","v":0}]
[]
[]
[]
[]
[]
[]
[]
[]
[]
[]
[]
[]
[]
[null,{"$f":"B63","v":"Belo Horizonte, 17 de abril de 2023."},null,null,null,null,null,null,null,null,null,"Operador:"]
[null,{"$f":"B64","v":"Nova Lima - Jardim Canadá"},null,null,null,null,null,null,null,null,null,"Verificador:",null,{"$f":"N64","v":"ION"}]
[]
[null,"Nota: A repetição deste ensaio estará sujeita a aprovação prévia e por escrito da contratante."]

{"sheet":"HRB_SUCS","index":3,"n_rows":42,"n_cols":9,"rows_kept":42,"cut":false,"hidden":true,"merged":[[7,0,7,8],[0,0,0,8],[1,0,1,8],[2,0,2,8],[3,0,3,8],[4,0,4,8],[33,0,33,6],[15,0,15,8],[18,0,18,2],[18,6,18,8],[19,0,19,1],[20,6,20,7],[26,0,26,3],[26,6,26,8],[27,6,27,7],[28,6,28,7],[29,2,29,3],[29,6,29,7],[32,0,32,1],[34,0,34,1],[34,2,35,2],[34,3,34,6],[38,0,38,4],[39,0,40,0],[39,1,40,1],[39,2,40,2],[39,3,39,4]]}
[]
[]
["EXÉRCITO BRASILEIRO "]
["INSTITUTO MILITAR DE ENGENHARIA"]
["         DEPARTAMENTO DE ENGENHARIA DE FORTIFICAÇÃO E CONSTRUÇÃO"]
[]
[]
["CLASSIFICAÇÃO DE SOLOS"]
[]
[]
[]
[]
[]
[]
[]
["CARACTERIZAÇÃO DO SOLO"]
[]
[]
["LIMITES",null,null,null,null,null,"GRANULOMETRIA"]
["Limite Liquidez (LL)",null,{"$f":"IF(CARACTERIZAÇÃO!D118=\"NL\",0,CARACTERIZAÇÃO!D118)","v":39.200000000000003}]
["LimitePlasticidade (LP)",null,{"$f":"IF(CARACTERIZAÇÃO!D119=\"NP\",0,CARACTERIZAÇÃO!D119)","v":25.511706418179038},null,null,null,"% Passa Peneira 4      (4,8mm)",null,{"$f":"CARACTERIZAÇÃO!N118","v":78.626272968825262}]
["Índice de Plasticidade (IP)",null,{"$f":"(C20-C21)","v":13.688293581820965},null,null,null,"% Passa Peneira 10    (2,0mm)",null,{"$f":"CARACTERIZAÇÃO!N119","v":71.442992591766199}]
["Variável (a)",{"$f":"IF(IF((I24-35)<0,0,(I24-35))>40,40,IF((I24-35)<0,0,(I24-35)))","v":21.602283525106031},null,"0 < a < 40",null,null,"% Passa Peneira 40    (0,42mm)",null,{"$f":"CARACTERIZAÇÃO!N120","v":65.043319562332954}]
["Variável (b)",{"$f":"IF(IF((I24-15)<0,0,(I24-15))>40,40,IF((I24-15)<0,0,(I24-15)))","v":40},null,"0 < b < 40",null,null,"% Passa Peneira 200 (0,075mm)",null,{"$f":"CARACTERIZAÇÃO!R118","v":56.602283525106031}]
["Variável (c)",{"$f":"IF(IF((C20-40)<0,0,(C20-40))>20,20,IF((C20-40)<0,0,(C20-40)))","v":0},null,"0 < c < 20",null,null,"Índice de Grupo (IG)",null,{"$f":"IF(((0.2)*B23)+((0.005)*(B23)*(B25))+((0.01)*(B24)*(B26))<0,0,((0.2)*B23)+((0.005)*(B23)*(B25))+((0.01)*(B24)*(B26)))","v":5.7957741377495928}]
["Variável (d)",{"$f":"IF(IF((C22-10)<0,0,(C22-10))>20,20,IF((C22-10)<0,0,(C22-10)))","v":3.6882935818209646},null,"0 < d < 20"]
["CLASSIFICAÇÃO",null,null,null,null,null,{"$f":"'HRB_SUCS(Dados)'!E17","v":"APAGUE OS VALORES DE (D10;D30;D60)"}]
[null,null,null,null,null,null,"d10"]
["CLASSIFICAÇÃO  \"HRB\"",null,{"$f":"C32","v":"A-6"},{"$f":"D32","v":" "},null,null,"d30"]
["CLASSIFICAÇÃO  \"SUCS\"",null,{"$f":"'HRB_SUCS(Dados)'!C21","v":"ML"},null,null,null,"d60"]
[]
[null,null,{"$f":"IF(C37=\"NP\",\"NP\",IF(B42=TRUE,\"A-5\",IF(C42=TRUE,\"A-6\",IF(D42=TRUE,\"A-7-5\",IF(E42=TRUE,\"A-7-6\",\" \")))))","v":"A-6"},{"$f":"IF(A37=TRUE,\"A-1a\",IF(B37=TRUE,\"A-1b\",IF(C37=TRUE,\"A-3\",IF(D37=TRUE,\"A-2-4\",IF(E37=TRUE,\"A-2-5\",IF(F37=TRUE,\"A-2-6\",IF(G37=TRUE,\"A-2-7\",IF(A42=TRUE,\"A-4\",\" \"))))))))","v":" "}]
[]
[]
[]
[]
[{"$f":"IF(C20<C21,\"NP\",AND(I26=0,C22<=6,I24<=15,I23<=30,I22<=50))","v":false},{"$f":"IF(C20<C21,\"NP\",AND(I25=0,C22<=6,I24<=25,I23<=50))","v":false},{"$f":"IF(C22<0,IF(D37=\"NP\",IF(I25=0,IF(I24<=10,IF(I23>50,AND(I25=0,C22<0,I24<=10,I23>50),\"NP\")))))","v":false},{"$f":"IF(C20<C21,\"NP\",AND(I25=0,C22<=10,C20<=40,I24<35))","v":false},{"$f":"IF(C20<C21,\"NP\",AND(I25=0,C22<=10,C20>40,I24<=35))","v":false},{"$f":"IF(C20<C21,\"NP\",AND(I25<=4,C22>10,C20<=40,I24<=35))","v":false},{"$f":"IF(C20<C21,\"NP\",AND(I25<=4,C22>10,C20>40,I24<=35))","v":false}]
[]
[]
[]
[]
[{"$f":"IF(C20<C21,\"NP\",AND(I26<=8,C22<=10,C20<=40,I24>35))","v":false},{"$f":"IF(C20<C21,\"NP\",AND(I25<=12,C22<=10,C20>40,I24>35))","v":false},{"$f":"IF(C20<C21,\"NP\",AND(I25<=16,C22>10,C20<=40,I24>35))","v":true},{"$f":"IF(C20<C21,\"NP\",AND(I25<=20,C22>10,C20>40,I24>35,C22<=C20-30))","v":false},{"$f":"IF(C20<C21,\"NP\",AND(I25<=20,C22>10,C20>40,I24>35,C22>C20-30))","v":false}]

{"sheet":"HRB_SUCS(Dados)","index":4,"n_rows":58,"n_cols":9,"rows_kept":58,"cut":false,"hidden":true,"merged":[[33,8,33,9],[29,8,29,9],[21,5,21,6],[22,5,22,6],[51,0,51,4],[25,0,25,4],[14,4,14,7],[15,4,15,7],[20,2,20,3],[16,4,16,8],[20,0,20,1],[18,5,18,6],[19,5,19,6],[20,5,20,6],[11,4,11,7],[12,4,12,7],[13,4,13,7],[7,0,7,8],[1,0,1,8],[2,0,2,8],[3,0,3,8],[4,0,4,8]]}
[]
[]
[]
[]
[]
[]
[]
["CLASSIFICAÇÃO DE SOLOS - SUCS"]
[]
[]
[]
["Limite Liquidez (LL)",null,{"$f":"HRB_SUCS!C20","v":39.200000000000003},null,"% Passa Peneira   4    (4,8mm)",null,null,null,{"$f":"HRB_SUCS!I21","v":78.626272968825262}]
["Limite Plasticidade(LP)",null,{"$f":"HRB_SUCS!C21","v":25.511706418179038},null,"% Passa Peneira 10    (2,0mm)",null,null,null,{"$f":"HRB_SUCS!I22","v":71.442992591766199}]
["Índice de Plasticidade(IP)",null,{"$f":"HRB_SUCS!C22","v":13.688293581820965},null,"% Passa Peneira 40    (0,42mm)",null,null,null,{"$f":"HRB_SUCS!I23","v":65.043319562332954}]
["Índice de Plasticidade da reta (IPreta)",null,{"$f":"0.73*(C12-20)","v":14.016000000000002},null,"% Passa Peneira 200  (0,075mm)",null,null,null,{"$f":"HRB_SUCS!I24","v":56.602283525106031}]
[]
[null,null,null,null,{"$f":"IF(I15>=0,IF(I15<=12,\"ATUALIZE OS DADOS DE (D10;D30;D60)\",\"APAGUE OS VALORES DE (D10;D30;D60)\"))","v":"APAGUE OS VALORES DE (D10;D30;D60)"}]
[]
[null,null,null,null,null,"D10",null,{"$f":"HRB_SUCS!I28","v":0}]
[null,null,null,null,null,"D30",null,{"$f":"HRB_SUCS!I29","v":0}]
["CLASSIFICAÇÃO - SUCS",null,{"$f":"CONCATENATE(F32,F44,F56)","v":"ML"},null,null,"D60",null,{"$f":"HRB_SUCS!I30","v":0}]
[{"$f":"IF(C22=\"\",\"N\",\"S\")","v":"N"},null,null,null,null,"Cu",null,{"$f":"IF(HRB_SUCS!I30=\"\",0,HRB_SUCS!I30/HRB_SUCS!I28)","v":0}]
[{"$f":"IF(C23=\"\",\"N\",\"S\")","v":"N"},null,null,null,null,"Cc",null,{"$f":"IF(HRB_SUCS!I29=\"\",0,POWER(HRB_SUCS!I29,2)/(HRB_SUCS!I28*HRB_SUCS!I30))","v":0}]
[{"$f":"IF(C24=\"\",\"N\",\"S\")","v":"N"}]
[{"$f":"IF(C25=\"\",\"N\",\"S\")","v":"N"}]
["Granulação Grossa"]
[]
[null,"GW",{"$f":"IF(I15<=50,IF(I12<=50,IF(I15<5,IF(H22>4,IF(H23>1,IF(H23<3,\"GW\",\"FALSO\"))))))","v":false}]
[null,"GW-GM",{"$f":"IF(C37=\"GW-GM/GW-GC\",\"FALSO\",IF(I12<=50,IF(I15>=5,IF(I15<=12,IF(H22>4,IF(H23>1,IF(H23<3,IF(C14<=C15,\"GW-GM\",\"FALSO\"))))))))","v":false},{"$f":"IF(C28=\"GW\",\"GW\",IF(C29=\"GW-GM\",\"GW-GM\",IF(C30=\"GW-GC\",\"GW-GC\",\"\")))","v":""}]
[null,"GW-GC",{"$f":"IF(C37=\"GW-GM/GW-GC\",\"FALSO\",IF(I12<=50,IF(I15>=5,IF(I15<=12,IF(H22>4,IF(H23>1,IF(H23<3,IF(C14>C15,\"GW-GC\",\"FALSO\"))))))))","v":false}]
[null,"GP",{"$f":"IF(I15<=50,IF(I12<=50,IF(I15<5,IF(H22>4,IF(H23>1,IF(H23>3,\"GP\",\"FALSO\"))))))","v":false},null,null,"Resposta"]
[null,"GP-GM",{"$f":"IF(C38=\"GP-GM/GP-GC\",\"FALSO\",IF(I12<=50,IF(I15>=5,IF(I15<=12,IF(H22>4,IF(H23>1,IF(H23>3,IF(C14<=C15,\"GP-GM\",\"FALSO\"))))))))","v":false},{"$f":"IF(C31=\"GP\",\"GP\",IF(C32=\"GP-GM\",\"GP-GM\",IF(C33=\"GP-GC\",\"GP-GC\",\"\")))","v":""},null,{"$f":"CONCATENATE(D29,D32,D35)","v":""}]
[null,"GP-GC",{"$f":"IF(C38=\"GP-GM/GP-GC\",\"FALSO\",IF(I12<=50,IF(I15>=5,IF(I15<=12,IF(H22>4,IF(H23>1,IF(H23>3,IF(C14>C15,\"GP-GC\",\"FALSO\"))))))))","v":false}]
[null,"GM",{"$f":"IF(I15<=50,IF(I12<=50,IF(I15>12,IF(C14<=C15,\"GM\",\"FALSO\"))))","v":false}]
[null,"GC",{"$f":"IF(I15<=50,IF(I12<=50,IF(I15>12,IF(C14>C15,IF(C14>7,\"GC\",\"FALSO\")))))","v":false},{"$f":"IF(C34=\"GM\",\"GM\",IF(C35=\"GC\", \"GC\",IF(C36=\"GM-GC\",\"GM-GC\",IF(C37=\"GW-GM/GW-GC\",\"GW-GM/GW-GC\",IF(C38=\"GP-GM/GP-GC\",\"GP-GM/GP-GC\",\"\")))))","v":""}]
[null,"GM-GC",{"$f":"IF(I15<=50,IF(I12<=50,IF(I15>12,IF(C14>C15,IF(C14>=4,IF(C14<=7,\"GM-GC\",\"FALSO\"))))))","v":false}]
[null,"GW-GM / GW-GC",{"$f":"IF(I12<=50,IF(I15>=5,IF(I15<=12,IF(H22>4,IF(H23>1,IF(H23<3,IF(C14>=4,IF(C14<=7,\"GW-GM/GW-GC\",\"FALSO\"))))))))","v":false}]
[null,"GP-GM / GP-GC",{"$f":"IF(I12<=50,IF(I15>=5,IF(I15<=12,IF(H22>4,IF(H23>1,IF(H23>3,IF(C14>=4,IF(C14<=7,\"GP-GM/GP-GC\",\"FALSO\"))))))))","v":false}]
[]
[null,"SW",{"$f":"IF(I15<=50,IF(I12>50,IF(I15<5,IF(H22>6,IF(H23>1,IF(H23<3,\"SW\",\"FALSO\"))))))","v":false}]
[null,"SW-SM",{"$f":"IF(C49=\"SW-SM/SW-SC\",\"FALSO\",IF(I12>50,IF(I15>=5,IF(I15<=12,IF(H22>6,IF(H23>1,IF(H23<3,IF(C14<=C15,\"SW-SM\",\"FALSO\"))))))))","v":false},{"$f":"IF(C40=\"SW\",\"SW\",IF(C41=\"SW-SM\",\"SW-SM\",IF(C42=\"SW-SC\",\"SW-SC\",\"\")))","v":""}]
[null,"SW-SC",{"$f":"IF(C49=\"SW-SM/SW-SC\",\"FALSO\",IF(I12>50,IF(I15>=5,IF(I15<=12,IF(H22>6,IF(H23>1,IF(H23<3,IF(C14>C15,\"SW-SC\",\"FALSO\"))))))))","v":false}]
[null,"SP",{"$f":"IF(I15<=50,IF(I12>50,IF(I15<5,IF(H22>4,IF(H23>1,IF(H23>3,\"SP\",\"FALSO\"))))))","v":false},null,null,"Resposta"]
[null,"SP-SM",{"$f":"IF(C50=\"SP-SM/SP-SC\",\"FALSO\",IF(I12>50,IF(I15>=5,IF(I15<=12,IF(H22>6,IF(H23>1,IF(H23>3,IF(C14<=C15,\"SP-SM\",\"FALSO\"))))))))","v":false},{"$f":"IF(C43=\"SP\",\"SP\",IF(C44=\"SP-SM\",\"SP-SM\",IF(C45=\"SP-SC\",\"SP-SC\",\"\")))","v":""},null,{"$f":"CONCATENATE(D41,D44,D47)","v":""}]
[null,"SP-SC",{"$f":"IF(C50=\"SP-SM/SP-SC\",\"FALSO\",IF(I12>50,IF(I15>=5,IF(I15<=12,IF(H22>6,IF(H23>1,IF(H23>3,IF(C14>C15,\"SP-SC\",\"FALSO\"))))))))","v":false}]
[null,"SM",{"$f":"IF(I15<=50,IF(I12>50,IF(I15>12,IF(C14<=C15,\"SM\",IF(C12=0,IF(C14=0,\"SM\"))))))","v":false}]
[null,"SC",{"$f":"IF(I15<=50,IF(I12>50,IF(I15>12,IF(C14>C15,IF(C14>7,\"SC\",\"FALSO\")))))","v":false},{"$f":"IF(C46=\"SM\",\"SM\",IF(C47=\"SC\",\"SC\",IF(C48=\"SM-SC\",\"SM-SC\",IF(C49=\"SW-SM/SW-SC\",\"SW-SM/SW-SC\",IF(C50=\"SP-SM/SP-SC\",\"SP-SM/SP-SC\",\"\")))))","v":""}]
[null,"SM-SC",{"$f":"IF(I15<=50,IF(I12>50,IF(I15>12,IF(C14>C15,IF(C14>=4,IF(C14<=7,\"SM-SC\",\"FALSO\"))))))","v":false}]
[null,"SW-SM / SW-SC",{"$f":"IF(I15>=5,IF(I15<=12,IF(H22>6,IF(H23>1,IF(H23<3,IF(C14>C15,IF(C14>=4,IF(C14<=7,\"SW-SM/SW-SC\",\"FALSO\"))))))))","v":false}]
[null,"SP-SM / SP-SC",{"$f":"IF(I15>=5,IF(I15<=12,IF(H22>6,IF(H23>1,IF(H23>3,IF(C14>C15,IF(C14>=4,IF(C14<=7,\"SP-SM/SP-SC\",\"FALSO\"))))))))","v":false}]
[]
["Granulação Fina"]
[]
[null,"ML",{"$f":"IF(I15>50,IF(C12<=50,IF(C14<C15,\"ML\",\"FALSO\")))","v":"ML"}]
[null,"ML-CL",{"$f":"IF(I15>50,IF(C12<=50,IF(C14>C15,IF(C14>=4,IF(C14<=7,\"ML-CL\",\"FALSO\")))))","v":false},null,null,"Resposta"]
[null,"CL",{"$f":"IF(I15>50,IF(C12<=50,IF(C14>C15,IF(C14>7,\"CL\",\"FALSO\"))))","v":false},null,null,{"$f":"IF(C54=\"ML\",\"ML\",IF(C55=\"ML-CL\",\"ML-CL\",IF(C56=\"CL\",\"CL\",IF(C57=\"MH\",\"MH\",IF(C58=\"CH\",\"CH\",\"\")))))","v":"ML"}]
[null,"MH",{"$f":"IF(I15>50,IF(C12>50,IF(C14<C15,\"MH\",\"FALSO\")))","v":false}]
[null,"CH",{"$f":"IF(I15>50,IF(C12>50,IF(C14>C15,\"CH\",\"FALSO\")))","v":false}]

{"sheet":"TABELAS","index":5,"n_rows":242,"n_cols":23,"rows_kept":242,"cut":false,"hidden":true,"merged":[]}
["N°","Capsula GPS",null,"Capsula CPN","Peso Cilindro G","Volume","T","Densidade A. T","Volume Cilindro P","Peso Cilindro P",null,null,"Temperatura (°C)","Viscosidade (g.s/cm²) ",null,"Energia","Cilindro","Balança","Estufa","Termômetro","Béquer/ Proveta/ Picnômetro","Laboratorista","Verificador"]
[1,11.8,null,80.16,4206,2063,15,0.99909999999999999,999,2310,null,null,11,1.2989999999999999E-5,null,"Normal","Grande","BLÇ-001","ET-001","TRM-001","001","André","DLFF"]
[2,19.760000000000002,null,81.25,4098,2055,15.1,0.99909999999999999,1000,2268.16,null,null,11.1,1.2954E-5,null,"Intermediário","Pequeno","BLÇ-002","ET-002","TRM-002","002","Antônio","ION"]
[3,18.420000000000002,null,80.89,4130,2074,15.2,0.99909999999999999,994,2340.64,null,null,11.2,1.2918000000000001E-5,null,"Modificado",null,"BLÇ-003",null,"TRM-003","003","Anthony","JGRCL"]
[4,18.739999999999998,null,80.23,4258,2072,15.3,0.99909999999999999,999,2340.1799999999998,null,null,11.3,1.2882E-5,null,"Golpes",null,"BLÇ-004",null,"TRM-005","004","Douglas"]
[5,18.64,null,80.19,4252,2056,15.4,0.99909999999999999,1002,2362.96,null,null,11.4,1.2846E-5,null,12,null,"BLÇ-005",null,"TRM-004","005","Igor"]
[6,19.2,null,81.42,4088,2062,15.5,0.999,998,2382.23,null,null,11.5,1.2809999999999999E-5,null,21,null,null,null,"TRM-007","006","Izabela"]
[7,19.07,null,94.92,4160,2067,15.6,0.999,1000,2343.8000000000002,null,null,11.6,1.2774E-5,null,26,null,null,null,"TRM-006","007","João Gustavo"]
[8,null,null,79.22,4162,2076,15.7,0.999,999,2370.59,null,null,11.7,1.2738000000000001E-5,null,27,null,null,null,"TRM-008","008","Riktiele"]
[9,null,null,81.86,4230,2055,15.8,0.999,1000,2332.91,null,null,11.8,1.2702E-5,null,55,null,null,null,"TRM-009","009","Sandro"]
[10,null,null,94.12,4134,2068,15.9,0.999,1002,2345,null,null,11.9,1.2666E-5,null,null,null,null,null,"TRM-010","010"]
[11,16.64,null,80.87,4392,2062,16,0.999,null,null,null,null,12,1.2630000000000001E-5,null,null,null,null,null,null,"011"]
[12,null,null,84.82,4070,2092,16.100000000000001,0.999,null,null,null,null,12.1,1.2597000000000002E-5,null,null,null,null,null,null,"012"]
[13,11.4,null,84.06,4166,2062,16.2,0.99890000000000001,null,null,null,null,12.2,1.2564E-5,null,null,null,null,null,null,"013"]
[14,16.53,null,84.13,4194,2061,16.3,0.99890000000000001,null,null,null,null,12.3,1.2531000000000001E-5,null,null,null,null,null,null,"014"]
[15,18.329999999999998,null,83.99,4125,2075,16.399999999999999,0.99890000000000001,null,null,null,null,12.4,1.2498000000000001E-5,null,null,null,null,null,null,"015"]
[16,19.13,null,84.81,4222,2060,16.5,0.99890000000000001,null,null,null,null,12.5,1.2465E-5,null,null,null,null,null,null,"016"]
[17,17.93,null,82.49,4258,2052,16.600000000000001,0.99890000000000001,null,null,null,null,12.6,1.2432000000000001E-5,null,null,null,null,null,null,"017"]
[18,19.03,null,84,4136,2066,16.7,0.99890000000000001,null,null,null,null,12.7,1.2399000000000001E-5,null,null,null,null,null,null,"018"]
[19,null,null,83.9,4226,2061,16.8,0.99880000000000002,null,null,null,null,12.8,1.2366000000000002E-5,null,null,null,null,null,null,"019"]
[20,11.11,null,97.62,4254,2063,16.899999999999999,0.99880000000000002,null,null,null,null,12.9,1.2333E-5,null,null,null,null,null,null,"020"]
[21,17.91,null,83.85,4268,2067,17,0.99880000000000002,null,null,null,null,13,1.2300000000000001E-5]
[22,18.22,null,85.95,4202,2069,17.100000000000001,0.99880000000000002,null,null,null,null,13.1,1.2268E-5,null,"Sim","janeiro"]
[23,18.41,null,90.76,4208,2062,17.2,0.99880000000000002,null,null,null,null,13.2,1.2235999999999999E-5,null,"Não","fevereiro"]
[24,11.04,null,84.08,4144,2065,17.3,0.99870000000000003,null,null,null,null,13.3,1.2204E-5,null,null,"março"]
[25,12.02,null,96.12,4106,2068,17.399999999999999,0.99870000000000003,null,null,null,null,13.4,1.2172E-5,null,null,"abril"]
[26,12.17,null,91.33,4164,2070,17.5,0.99870000000000003,null,null,null,null,13.5,1.2140000000000001E-5,null,null,"maio"]
[27,18.170000000000002,null,98.98,4262,2059,17.600000000000001,0.99870000000000003,null,null,null,null,13.6,1.2108E-5,null,null,"junho"]
[28,17.989999999999998,null,91.29,4198,2067,17.7,0.99870000000000003,null,null,null,null,13.7,1.2075999999999999E-5,null,null,"julho"]
[29,18.62,null,97.98,4252,2058,17.8,0.99870000000000003,null,null,null,null,13.8,1.2044E-5,null,null,"agosto"]
[30,18.89,null,83.56,4182,2068,17.899999999999999,0.99860000000000004,null,null,null,null,13.9,1.2012E-5,null,null,"setembro"]
[31,18,null,58.82,4074,2061,18,0.99860000000000004,null,null,null,null,14,1.198E-5,null,null,"outubro"]
[32,11.87,null,55.97,4242,2057,18.100000000000001,0.99860000000000004,null,null,null,null,14.1,1.1950000000000001E-5,null,null,"novembro"]
[33,12.14,null,54.05,4148,2067,18.2,0.99860000000000004,null,null,null,null,14.2,1.1919999999999999E-5,null,null,"dezembro"]
[34,18.43,null,57.5,4118,2081,18.3,0.99860000000000004,null,null,null,null,14.3,1.189E-5]
[35,18.649999999999999,null,53.79,4232,2059,18.399999999999999,0.99850000000000005,null,null,null,null,14.4,1.1859999999999998E-5]
[36,18.190000000000001,null,54.57,4186,2066,18.5,0.99850000000000005,null,null,null,null,14.5,1.183E-5]
[37,11.27,null,56.04,4122,2062,18.600000000000001,0.99850000000000005,null,null,null,null,14.6,1.1800000000000001E-5]
[38,17.32,null,58.47,4086,2079,18.7,0.99850000000000005,null,null,null,null,14.7,1.1769999999999999E-5]
[39,17.48,null,56.81,4182,2078,18.8,0.99850000000000005,null,null,null,null,14.8,1.1739999999999999E-5]
[40,18.170000000000002,null,59.29,4054,2066,18.899999999999999,0.99850000000000005,null,null,null,null,14.9,1.1709999999999998E-5]
[41,11.82,null,57.79,4144,2072,19,0.99839999999999995,null,null,null,null,15,1.168E-5]
[42,17.72,null,53.19,4158,2080,19.100000000000001,0.99839999999999995,null,null,null,null,15.1,1.165E-5]
[43,18.649999999999999,null,55.08,4195,2065,19.2,0.99839999999999995,null,null,null,null,15.2,1.1619999999999999E-5]
[44,17.600000000000001,null,56.05,4206,2059,19.3,0.99839999999999995,null,null,null,null,15.3,1.1589999999999999E-5]
[45,18.04,null,61.13,4150,2081,19.399999999999999,0.99839999999999995,null,null,null,null,15.4,1.1559999999999999E-5]
[46,18.77,null,56.23,4176,2078,19.5,0.99829999999999997,null,null,null,null,15.5,1.1530000000000001E-5]
[47,11.13,null,56.73,4132,2043,19.600000000000001,0.99829999999999997,null,null,null,null,15.6,1.15E-5]
[48,18.329999999999998,null,58.89,4218,2062,19.7,0.99829999999999997,null,null,null,null,15.7,1.147E-5]
[49,17.16,null,45.19,4194,2055,19.8,0.99826999999999999,null,null,null,null,15.8,1.1440000000000001E-5]
[50,11.16,null,57.68,4100,2073,19.899999999999999,0.99824999999999997,null,null,null,null,15.9,1.1409999999999999E-5]
[51,17.84,null,null,4238,2074,20,0.99822999999999995,null,null,null,null,16,1.1379999999999999E-5]
[52,17.440000000000001,null,null,4138,2081,20.100000000000001,0.99821000000000004,null,null,null,null,16.100000000000001,1.1351E-5]
[53,11.8,null,null,4144,2066,20.2,0.99819000000000002,null,null,null,null,16.2,1.1322000000000001E-5]
[54,11.91,null,null,4208,2073,20.3,0.99817,null,null,null,null,16.3,1.1293E-5]
[55,18.96,null,null,4162,2063,20.399999999999999,0.99814999999999998,null,null,null,null,16.399999999999999,1.1264000000000001E-5]
[56,18.73,null,null,4148,2063,20.5,0.99812999999999996,null,null,null,null,16.5,1.1234999999999998E-5]
[57,19.29,null,null,4282,2061,20.6,0.99809999999999999,null,null,null,null,16.600000000000001,1.1205999999999999E-5]
[58,18.07,null,null,4108,2069,20.7,0.99807999999999997,null,null,null,null,16.7,1.1177E-5]
[59,18.43,null,null,4114,2068,20.8,0.99805999999999995,null,null,null,null,16.8,1.1147999999999999E-5]
[60,11.83,null,null,4128,2062,20.9,0.99804000000000004,null,null,null,null,16.899999999999999,1.1119E-5]
[61,18.899999999999999,null,null,4220,2059,21,0.99802000000000002,null,null,null,null,17,1.1089999999999999E-5]
[62,19.559999999999999,null,null,4244,2053,21.1,0.998,null,null,null,null,17.100000000000001,1.1061999999999998E-5]
[63,18.05,null,null,4174,2077,21.2,0.99797999999999998,null,null,null,null,17.2,1.1034E-5]
[64,18.829999999999998,null,null,4174,2069,21.3,0.99795999999999996,null,null,null,null,17.3,1.1005999999999999E-5]
[65,18.75,null,null,4182,2063,21.4,0.99792999999999998,null,null,null,null,17.399999999999999,1.0977999999999999E-5]
[66,19.32,null,null,4772,2058,21.5,0.99790999999999996,null,null,null,null,17.5,1.0949999999999998E-5]
[67,11.25,null,null,4234,2059,21.6,0.99789000000000005,null,null,null,null,17.600000000000001,1.0922E-5]
[68,18.53,null,null,4134,2058,21.7,0.99787000000000003,null,null,null,null,17.7,1.0893999999999999E-5]
[69,18.37,null,null,4142,2077,21.8,0.99785000000000001,null,null,null,null,17.8,1.0865999999999999E-5]
[70,17.46,null,null,4158,2080,21.9,0.99782999999999999,null,null,null,null,17.899999999999999,1.0838E-5]
[71,12.03,null,null,4184,2067,22,0.99780000000000002,null,null,null,null,18,1.081E-5]
[72,17.57,null,null,4266,2069,22.1,0.99778,null,null,null,null,18.100000000000001,1.0783E-5]
[73,18.559999999999999,null,null,4102,2081,22.2,0.99775000000000003,null,null,null,null,18.2,1.0756E-5]
[74,11.73,null,null,4134,2065,22.3,0.99773000000000001,null,null,null,null,18.3,1.0728999999999998E-5]
[75,11.88,null,null,4134,2069,22.4,0.99770000000000003,null,null,null,null,18.399999999999999,1.0702E-5]
[76,12.31,null,null,4118,2059,22.5,0.99768000000000001,null,null,null,null,18.5,1.0675E-5]
[77,18.52,null,null,4110,2053,22.6,0.99765000000000004,null,null,null,null,18.600000000000001,1.0647999999999999E-5]
[78,18.46,null,null,4068,2079,22.7,0.99763000000000002,null,null,null,null,18.7,1.0620999999999999E-5]
[79,18.989999999999998,null,null,4054,2085,22.8,0.99761,null,null,null,null,18.8,1.0593999999999999E-5]
[80,18.850000000000001,null,null,4134,2066,22.9,0.99758000000000002,null,null,null,null,18.899999999999999,1.0566999999999999E-5]
[81,17.239999999999998,null,null,4076,2089,23,0.99756,null,null,null,null,19,1.0539999999999999E-5]
[82,18.690000000000001,null,null,4164,2078,23.1,0.99753999999999998,null,null,null,null,19.100000000000001,1.0514999999999998E-5]
[83,12.28,null,null,4168,2080,23.2,0.99751000000000001,null,null,null,null,19.2,1.0489999999999998E-5]
[84,11.26,null,null,4090,2060,23.3,0.99748999999999999,null,null,null,null,19.3,1.0464999999999999E-5]
[85,12.2,null,null,3966,2062,23.4,0.99746000000000001,null,null,null,null,19.399999999999999,1.0439999999999998E-5]
[86,12.19,null,null,4214,2062,23.5,0.99743999999999999,null,null,null,null,19.5,1.0414999999999999E-5]
[87,18.45,null,null,4190,2074,23.6,0.99741999999999997,null,null,null,null,19.600000000000001,1.0389999999999999E-5]
[88,17.09,null,null,4190,2065,23.7,0.99739,null,null,null,null,19.7,1.0364999999999998E-5]
[89,11.6,null,null,4094,2075,23.8,0.99736999999999998,null,null,null,null,19.8,1.0339999999999999E-5]
[90,11.88,null,null,4766,2083,23.9,0.99734,null,null,null,null,19.899999999999999,1.0314999999999999E-5]
[91,18.2,null,null,4778,2078,24,0.99731999999999998,null,null,null,null,20,1.0289999999999998E-5]
[92,11.83,null,null,4792,2082,24.1,0.99729000000000001,null,null,null,null,20.100000000000001,1.0263999999999999E-5]
[93,11.33,null,null,4854,2063,24.2,0.99726999999999999,null,null,null,null,20.2,1.0237999999999999E-5]
[94,17.829999999999998,null,null,4706,2083,24.3,0.99724000000000002,null,null,null,null,20.3,1.0212E-5]
[95,null,null,null,4906,2065,24.4,0.99722,null,null,null,null,20.399999999999999,1.0185999999999999E-5]
[96,null,null,null,4776,2090,24.5,0.99719999999999998,null,null,null,null,20.5,1.0159999999999999E-5]
[97,null,null,null,4624,2063,24.6,0.99717,null,null,null,null,20.6,1.0133999999999998E-5]
[98,null,null,null,4740,2086,24.7,0.99714000000000003,null,null,null,null,20.7,1.0107999999999999E-5]
[99,null,null,null,4138,2067,24.8,0.99712000000000001,null,null,null,null,20.8,1.0081999999999998E-5]
[100,null,null,null,4748,2082,24.9,0.99709000000000003,null,null,null,null,20.9,1.0055999999999998E-5]
[101,null,null,null,null,null,25,0.99707000000000001,null,null,null,null,21,1.0029999999999999E-5]
[102,null,null,null,4880,2061,25.1,0.99704000000000004,null,null,null,null,21.1,1.0006999999999999E-5]
[103,null,null,null,4784,2080,25.2,0.99702000000000002,null,null,null,null,21.2,9.9839999999999996E-6]
[104,null,null,null,null,null,25.3,0.99699000000000004,null,null,null,null,21.3,9.961E-6]
[null,null,null,null,null,null,25.4,0.99697000000000002,null,null,null,null,21.4,9.9380000000000004E-6]
[null,null,null,null,null,null,25.5,0.99694000000000005,null,null,null,null,21.5,9.9149999999999991E-6]
[null,null,null,null,null,null,25.6,0.99690999999999996,null,null,null,null,21.6,9.8919999999999995E-6]
[null,null,null,null,null,null,25.7,0.99689000000000005,null,null,null,null,21.7,9.8689999999999999E-6]
[null,null,null,null,null,null,25.8,0.99687000000000003,null,null,null,null,21.8,9.8460000000000003E-6]
[null,null,null,null,null,null,25.9,0.99683999999999995,null,null,null,null,21.9,9.8230000000000006E-6]
[null,null,null,null,null,null,26,0.99680999999999997,null,null,null,null,22,9.800000000000001E-6]
[null,null,null,null,null,null,26.1,0.99678,null,null,null,null,22.1,9.7759999999999992E-6]
[null,null,null,null,null,null,26.2,0.99675999999999998,null,null,null,null,22.2,9.7520000000000008E-6]
[null,null,null,null,null,null,26.3,0.99673,null,null,null,null,22.3,9.7280000000000007E-6]
[null,null,null,null,null,null,26.4,0.99670000000000003,null,null,null,null,22.4,9.7040000000000006E-6]
[null,null,null,null,null,null,26.5,0.99668000000000001,null,null,null,null,22.5,9.6799999999999988E-6]
[null,null,null,null,null,null,26.6,0.99665000000000004,null,null,null,null,22.6,9.6560000000000004E-6]
[null,null,null,null,null,null,26.7,0.99663000000000002,null,null,null,null,22.7,9.6320000000000003E-6]
[null,null,null,null,null,null,26.8,0.99660000000000004,null,null,null,null,22.8,9.6080000000000002E-6]
[null,null,null,null,null,null,26.9,0.99656999999999996,null,null,null,null,22.9,9.5839999999999984E-6]
[null,null,null,null,null,null,27,0.99653999999999998,null,null,null,null,23,9.5599999999999999E-6]
[null,null,null,null,null,null,27.1,0.99651000000000001,null,null,null,null,23.1,9.5379999999999991E-6]
[null,null,null,null,null,null,27.2,0.99648000000000003,null,null,null,null,23.2,9.516E-6]
[null,null,null,null,null,null,27.3,0.99646000000000001,null,null,null,null,23.3,9.4939999999999992E-6]
[null,null,null,null,null,null,27.4,0.99643000000000004,null,null,null,null,23.4,9.4719999999999984E-6]
[null,null,null,null,null,null,27.5,0.99399999999999999,null,null,null,null,23.5,9.4499999999999993E-6]
[null,null,null,null,null,null,27.6,0.99636999999999998,null,null,null,null,23.6,9.4280000000000002E-6]
[null,null,null,null,null,null,27.7,0.99634,null,null,null,null,23.7,9.4059999999999994E-6]
[null,null,null,null,null,null,27.8,0.99631999999999998,null,null,null,null,23.8,9.3840000000000003E-6]
[null,null,null,null,null,null,27.9,0.99629000000000001,null,null,null,null,23.9,9.3619999999999995E-6]
[null,null,null,null,null,null,28,0.99626000000000003,null,null,null,null,24,9.3399999999999987E-6]
[null,null,null,null,null,null,28.1,0.99622999999999995,null,null,null,null,24.1,9.3189999999999984E-6]
[null,null,null,null,null,null,28.2,0.99619999999999997,null,null,null,null,24.2,9.2979999999999997E-6]
[null,null,null,null,null,null,28.3,0.99617,null,null,null,null,24.3,9.2770000000000011E-6]
[null,null,null,null,null,null,28.4,0.99614000000000003,null,null,null,null,24.4,9.2559999999999991E-6]
[null,null,null,null,null,null,28.5,0.99611000000000005,null,null,null,null,24.5,9.2349999999999988E-6]
[null,null,null,null,null,null,28.6,0.99607999999999997,null,null,null,null,24.6,9.2140000000000002E-6]
[null,null,null,null,null,null,28.7,0.99605999999999995,null,null,null,null,24.7,9.1930000000000016E-6]
[null,null,null,null,null,null,28.8,0.99602999999999997,null,null,null,null,24.8,9.1719999999999996E-6]
[null,null,null,null,null,null,28.9,0.996,null,null,null,null,24.9,9.1509999999999993E-6]
[null,null,null,null,null,null,29,0.99597000000000002,null,null,null,null,25,9.1300000000000007E-6]
[null,null,null,null,null,null,29.1,0.99594000000000005,null,null,null,null,25.1,9.1090000000000004E-6]
[null,null,null,null,null,null,29.2,0.99590999999999996,null,null,null,null,25.2,9.0880000000000001E-6]
[null,null,null,null,null,null,29.3,0.99587999999999999,null,null,null,null,25.3,9.0669999999999998E-6]
[null,null,null,null,null,null,29.4,0.99585000000000001,null,null,null,null,25.4,9.0460000000000011E-6]
[null,null,null,null,null,null,29.5,0.99582000000000004,null,null,null,null,25.5,9.0249999999999991E-6]
[null,null,null,null,null,null,29.6,0.99578999999999995,null,null,null,null,25.6,9.0039999999999988E-6]
[null,null,null,null,null,null,29.7,0.99575999999999998,null,null,null,null,25.7,8.9830000000000002E-6]
[null,null,null,null,null,null,29.8,0.99573,null,null,null,null,25.8,8.9619999999999999E-6]
[null,null,null,null,null,null,29.9,0.99570000000000003,null,null,null,null,25.9,8.9409999999999996E-6]
[null,null,null,null,null,null,30,0.99567000000000005,null,null,null,null,26,8.9199999999999993E-6]
[null,null,null,null,null,null,30.1,0.99563999999999997,null,null,null,null,26.1,8.8999999999999995E-6]
[null,null,null,null,null,null,30.2,0.99560999999999999,null,null,null,null,26.2,8.8799999999999997E-6]
[null,null,null,null,null,null,30.3,0.99558000000000002,null,null,null,null,26.3,8.8599999999999999E-6]
[null,null,null,null,null,null,30.4,0.99555000000000005,null,null,null,null,26.4,8.8400000000000001E-6]
[null,null,null,null,null,null,30.5,0.99551999999999996,null,null,null,null,26.5,8.8200000000000003E-6]
[null,null,null,null,null,null,30.6,0.99548999999999999,null,null,null,null,26.6,8.8000000000000004E-6]
[null,null,null,null,null,null,30.7,0.99546000000000001,null,null,null,null,26.7,8.7800000000000006E-6]
[null,null,null,null,null,null,30.8,0.99543000000000004,null,null,null,null,26.8,8.7599999999999991E-6]
[null,null,null,null,null,null,30.9,0.99539999999999995,null,null,null,null,26.9,8.7399999999999993E-6]
[null,null,null,null,null,null,31,0.99536999999999998,null,null,null,null,27,8.7199999999999995E-6]
[null,null,null,null,null,null,31.1,0.99533000000000005,null,null,null,null,27.1,8.7000000000000014E-6]
[null,null,null,null,null,null,31.2,0.99529999999999996,null,null,null,null,27.2,8.6799999999999999E-6]
[null,null,null,null,null,null,31.3,0.99526999999999999,null,null,null,null,27.3,8.6600000000000001E-6]
[null,null,null,null,null,null,31.4,0.99524000000000001,null,null,null,null,27.4,8.6400000000000003E-6]
[null,null,null,null,null,null,31.5,0.99521000000000004,null,null,null,null,27.5,8.6200000000000005E-6]
[null,null,null,null,null,null,31.6,0.99517999999999995,null,null,null,null,27.6,8.599999999999999E-6]
[null,null,null,null,null,null,31.7,0.99514999999999998,null,null,null,null,27.7,8.5799999999999992E-6]
[null,null,null,null,null,null,31.8,0.99512,null,null,null,null,27.8,8.5599999999999994E-6]
[null,null,null,null,null,null,31.9,0.99509000000000003,null,null,null,null,27.9,8.5399999999999996E-6]
[null,null,null,null,null,null,32,0.99504999999999999,null,null,null,null,28,8.5199999999999997E-6]
[null,null,null,null,null,null,32.1,0.99502000000000002,null,null,null,null,28.1,8.5019999999999992E-6]
[null,null,null,null,null,null,32.200000000000003,0.99499000000000004,null,null,null,null,28.2,8.4840000000000004E-6]
[null,null,null,null,null,null,32.299999999999997,0.99495999999999996,null,null,null,null,28.3,8.4659999999999982E-6]
[null,null,null,null,null,null,32.4,0.99492999999999998,null,null,null,null,28.4,8.4479999999999994E-6]
[null,null,null,null,null,null,32.5,0.99490000000000001,null,null,null,null,28.5,8.4299999999999989E-6]
[null,null,null,null,null,null,32.6,0.99485999999999997,null,null,null,null,28.6,8.4119999999999984E-6]
[null,null,null,null,null,null,32.700000000000003,0.99482999999999999,null,null,null,null,28.7,8.3939999999999996E-6]
[null,null,null,null,null,null,32.799999999999997,0.99480000000000002,null,null,null,null,28.8,8.3759999999999991E-6]
[null,null,null,null,null,null,32.9,0.99477000000000004,null,null,null,null,28.9,8.3580000000000003E-6]
[null,null,null,null,null,null,32.999999999999901,null,null,null,null,null,29,8.3399999999999998E-6]
[null,null,null,null,null,null,33.099999999999902,null,null,null,null,null,29.1,8.3219999999999993E-6]
[null,null,null,null,null,null,33.199999999999903,null,null,null,null,null,29.2,8.3040000000000005E-6]
[null,null,null,null,null,null,33.299999999999898,null,null,null,null,null,29.3,8.2859999999999999E-6]
[null,null,null,null,null,null,33.399999999999899,null,null,null,null,null,29.4,8.2680000000000011E-6]
[null,null,null,null,null,null,33.499999999999901,null,null,null,null,null,29.5,8.2499999999999989E-6]
[null,null,null,null,null,null,13.2,0.99939999999999996,null,null,null,null,29.6,8.2319999999999984E-6]
[null,null,null,null,null,null,null,null,null,null,null,null,29.7,8.2139999999999996E-6]
[null,null,null,null,null,null,null,null,null,null,null,null,29.8,8.1959999999999991E-6]
[null,null,null,null,null,null,null,null,null,null,null,null,29.9,8.1780000000000003E-6]
[null,null,null,null,null,null,null,null,null,null,null,null,30,8.1599999999999998E-6]
[null,null,null,null,null,null,null,null,null,null,null,null,30.1,8.1419999999999993E-6]
[null,null,null,null,null,null,null,null,null,null,null,null,30.2,8.1240000000000005E-6]
[null,null,null,null,null,null,null,null,null,null,null,null,30.3,8.106E-6]
[null,null,null,null,null,null,null,null,null,null,null,null,30.4,8.0880000000000012E-6]
[null,null,null,null,null,null,null,null,null,null,null,null,30.5,8.0700000000000007E-6]
[null,null,null,null,null,null,null,null,null,null,null,null,30.6,8.0519999999999985E-6]
[null,null,null,null,null,null,null,null,null,null,null,null,30.7,8.0339999999999997E-6]
[null,null,null,null,null,null,null,null,null,null,null,null,30.8,8.0159999999999991E-6]
[null,null,null,null,null,null,null,null,null,null,null,null,30.9,7.9980000000000003E-6]
[null,null,null,null,null,null,null,null,null,null,null,null,31,7.9799999999999998E-6]
[null,null,null,null,null,null,null,null,null,null,null,null,31.1,7.9640000000000003E-6]
[null,null,null,null,null,null,null,null,null,null,null,null,31.2,7.9480000000000008E-6]
[null,null,null,null,null,null,null,null,null,null,null,null,31.3,7.9319999999999996E-6]
[null,null,null,null,null,null,null,null,null,null,null,null,31.4,7.9160000000000001E-6]
[null,null,null,null,null,null,null,null,null,null,null,null,31.5,7.9000000000000006E-6]
[null,null,null,null,null,null,null,null,null,null,null,null,31.6,7.8839999999999994E-6]
[null,null,null,null,null,null,null,null,null,null,null,null,31.7,7.8679999999999999E-6]
[null,null,null,null,null,null,null,null,null,null,null,null,31.8,7.8520000000000004E-6]
[null,null,null,null,null,null,null,null,null,null,null,null,31.9,7.8359999999999992E-6]
[null,null,null,null,null,null,null,null,null,null,null,null,32,7.8199999999999997E-6]
[null,null,null,null,null,null,null,null,null,null,null,null,32.1,7.8040000000000002E-6]
[null,null,null,null,null,null,null,null,null,null,null,null,32.200000000000003,7.7880000000000007E-6]
[null,null,null,null,null,null,null,null,null,null,null,null,32.299999999999997,7.7719999999999994E-6]
[null,null,null,null,null,null,null,null,null,null,null,null,32.4,7.7559999999999999E-6]
[null,null,null,null,null,null,null,null,null,null,null,null,32.5,7.7400000000000004E-6]
[null,null,null,null,null,null,null,null,null,null,null,null,32.6,7.7239999999999992E-6]
[null,null,null,null,null,null,null,null,null,null,null,null,32.700000000000003,7.7079999999999997E-6]
[null,null,null,null,null,null,null,null,null,null,null,null,32.799999999999997,7.6920000000000002E-6]
[null,null,null,null,null,null,null,null,null,null,null,null,32.9,7.675999999999999E-6]
[null,null,null,null,null,null,null,null,null,null,null,null,33,7.6599999999999995E-6]
[null,null,null,null,null,null,null,null,null,null,null,null,33.1,7.644E-6]
[null,null,null,null,null,null,null,null,null,null,null,null,33.200000000000003,7.6279999999999996E-6]
[null,null,null,null,null,null,null,null,null,null,null,null,33.299999999999997,7.6120000000000001E-6]
[null,null,null,null,null,null,null,null,null,null,null,null,33.4,7.5959999999999998E-6]
[null,null,null,null,null,null,null,null,null,null,null,null,33.5,7.5799999999999994E-6]
[null,null,null,null,null,null,null,null,null,null,null,null,33.6,7.5639999999999999E-6]
[null,null,null,null,null,null,null,null,null,null,null,null,33.700000000000003,7.5479999999999996E-6]
[null,null,null,null,null,null,null,null,null,null,null,null,33.799999999999997,7.5320000000000001E-6]
[null,null,null,null,null,null,null,null,null,null,null,null,33.9,7.5159999999999997E-6]
[null,null,null,null,null,null,null,null,null,null,null,null,34,7.4999999999999993E-6]
[null,null,null,null,null,null,null,null,null,null,null,null,34.1,7.4949999999999994E-6]
[null,null,null,null,null,null,null,null,null,null,null,null,34.200000000000003,7.4900000000000003E-6]
[null,null,null,null,null,null,null,null,null,null,null,null,34.299999999999997,7.4850000000000003E-6]
[null,null,null,null,null,null,null,null,null,null,null,null,34.4,7.4800000000000004E-6]
[null,null,null,null,null,null,null,null,null,null,null,null,34.5,7.4749999999999996E-6]
[null,null,null,null,null,null,null,null,null,null,null,null,34.6,7.4699999999999996E-6]
[null,null,null,null,null,null,null,null,null,null,null,null,34.700000000000003,7.4649999999999997E-6]
[null,null,null,null,null,null,null,null,null,null,null,null,34.799999999999997,7.4599999999999997E-6]
[null,null,null,null,null,null,null,null,null,null,null,null,34.9,7.4549999999999998E-6]
[null,null,null,null,null,null,null,null,null,null,null,null,35,7.4499999999999998E-6]

{"sheet":"CALCULOS","index":6,"n_rows":274,"n_cols":40,"rows_kept":274,"cut":false,"hidden":true,"merged":[[1,16,1,20],[0,25,0,27],[1,25,1,27],[0,36,0,38],[7,25,7,27],[7,28,7,30],[7,31,7,33],[2,25,2,27],[3,25,3,27],[4,25,4,27],[5,25,5,27],[1,35,1,39]]}
[null,null,null,null,null,null,null,null,null,null,null,null,null,null,null,null,"HEXA",null,null,null,null,null,null,null,null,"Peso Específico dos Grãos:",null,null,{"$f":"CARACTERIZAÇÃO!R116","v":2.8896530890268872}]
[null,null,null,null,null,null,null,null,null,null,null,null,null,null,null,null,"CLB-DNS-01 (Hexa)",null,null,null,null,null,null,null,null,"Grau de Saturação 01:",null,null,1,null,null,null,null,null,null,"CLB-DNS-02 (Água)"]
[null,null,null,null,null,null,null,null,null,null,null,null,null,null,null,null,"Leitura","a'","a''","T °C","Correção ",null,null,null,null,"Grau de Saturação 02:",null,null,0.8,null,null,null,null,null,null,"Leitura","a'","a''","T °C","Correção "]
[null,null,null,null,null,null,null,null,null,null,null,null,null,null,null,null,995,21.58015,20.455582525951556,8,-3.0860500000000002,null,null,null,null,"Grau de Saturação 03:",null,null,0.9,null,null,null,null,null,null,995,21.205000000000002,20.021979819067504,8,2.4983099999999467]
[null,null,null,null,null,null,null,null,null,null,null,null,null,null,null,null,995.25,21.523967500000001,20.399400025951557,8.1,-3.0915491800000154,null,null,null,null,"Densidade da Água:",null,null,1,null,null,null,null,null,null,995.25,21.151,19.967979819067502,8.1,2.5062318399999413]
[null,null,null,null,null,null,null,null,null,null,null,null,null,null,null,null,995.5,21.467784999999999,20.343217525951559,8.1999999999999993,-3.0966802399999551,null,null,null,null,null,null,null,null,null,null,null,null,null,null,995.5,21.097000000000001,19.913979819067503,8.1999999999999993,2.5142095200000085]
[null,null,null,null,null,null,null,null,null,null,null,null,null,null,null,null,995.75,21.411602500000001,20.287035025951557,8.3000000000000007,-3.1014454600000363,null,null,null,null,null,null,null,null,null,null,null,null,null,null,995.75,21.042999999999999,19.859979819067501,8.3000000000000007,2.5222432799999979]
[null,null,null,null,null,null,null,null,null,null,null,null,null,null,null,null,996,21.355419999999999,20.230852525951555,8.4,-3.1058471200000213,null,null,null,null,"Teor de Umidade",null,null,"Densidade seca S=100%",null,null,"Densidade seca S=80%",null,null,null,996,20.989000000000001,19.805979819067502,8.4,2.530333359999986]
[null,null,null,null,null,null,null,null,null,null,null,null,null,null,null,null,996.25,21.2992375,20.174670025951556,8.5,-3.1098875000000135,null,null,null,null,{"$f":"CARACTERIZAÇÃO!$F$288/100","v":0.14517155279251617},{"$f":"CARACTERIZAÇÃO!$F$288","v":14.517155279251618},{"$f":"CARACTERIZAÇÃO!$F$298","v":1.657357955710016},{"$f":"($AC$5*$AC$1*$AC$2)/((Z9*$AC$1)+($AC$2*$AC$5))","v":2.0356903137331153},null,null,{"$f":"($AC$5*$AC$1*$AC$3)/((Z9*$AC$1)+($AC$3*$AC$5))","v":1.895638492773227},null,null,null,996.25,20.935000000000002,19.751979819067504,8.5,2.5384799999999359]
[null,null,null,null,null,null,null,null,null,null,null,null,null,null,null,null,996.5,21.243055000000002,20.118487525951558,8.6,-3.1135688800000025,null,null,null,null,{"$f":"CARACTERIZAÇÃO!$H$288/100","v":0.16637843339978498},{"$f":"CARACTERIZAÇÃO!$H$288","v":16.637843339978499},{"$f":"CARACTERIZAÇÃO!$H$298","v":1.6876962316013457},{"$f":"($AC$5*$AC$1*$AC$2)/((Z10*$AC$1)+($AC$2*$AC$5))","v":1.9514451738494587},null,null,{"$f":"($AC$5*$AC$1*$AC$3)/((Z10*$AC$1)+($AC$3*$AC$5))","v":1.8049390012075039},null,null,null,996.5,20.881,19.697979819067502,8.6,2.546683440000038]
[null,null,null,null,null,null,null,null,null,null,null,null,null,null,null,null,996.75,21.1868725,20.062305025951559,8.6999999999999993,-3.1168935399999782,null,null,null,null,{"$f":"CARACTERIZAÇÃO!$J$288/100","v":0.1875853140070538},{"$f":"CARACTERIZAÇÃO!$J$288","v":18.75853140070538},{"$f":"CARACTERIZAÇÃO!$J$298","v":1.7031348215347397},{"$f":"($AC$5*$AC$1*$AC$2)/((Z11*$AC$1)+($AC$2*$AC$5))","v":1.8738957506508629},null,null,{"$f":"($AC$5*$AC$1*$AC$3)/((Z11*$AC$1)+($AC$3*$AC$5))","v":1.7225224885055401},null,null,null,996.75,20.827000000000002,19.643979819067503,8.6999999999999993,2.5549439200000279]
[null,null,null,null,null,null,null,null,null,null,null,null,null,null,null,null,997,21.130690000000001,20.006122525951557,8.8000000000000007,-3.1198637600000438,null,null,null,null,{"$f":"CARACTERIZAÇÃO!$L$288/100","v":0.20879219461432263},{"$f":"CARACTERIZAÇÃO!$L$288","v":20.879219461432264},{"$f":"CARACTERIZAÇÃO!$L$298","v":1.6937306761034019},{"$f":"($AC$5*$AC$1*$AC$2)/((Z12*$AC$1)+($AC$2*$AC$5))","v":1.8022743008901305},null,null,{"$f":"($AC$5*$AC$1*$AC$3)/((Z12*$AC$1)+($AC$3*$AC$5))","v":1.647303858254332},null,null,null,997,20.773,19.589979819067501,8.8000000000000007,2.5632616799999823]
[null,null,null,null,null,null,null,null,null,null,null,null,null,null,null,null,997.25,21.074507499999999,19.949940025951555,8.9,-3.1224818199999618,null,null,null,null,{"$f":"CARACTERIZAÇÃO!$N$288/100","v":0.22999907522159149},{"$f":"CARACTERIZAÇÃO!$N$288","v":22.999907522159148},{"$f":"CARACTERIZAÇÃO!$N$298","v":1.6287761163228855},{"$f":"($AC$5*$AC$1*$AC$2)/((Z13*$AC$1)+($AC$2*$AC$5))","v":1.7359261348245965},null,null,{"$f":"($AC$5*$AC$1*$AC$3)/((Z13*$AC$1)+($AC$3*$AC$5))","v":1.5783796185333696},null,null,null,997.25,20.719000000000001,19.535979819067503,8.9,2.571636959999978]
[null,null,null,null,null,null,null,null,null,null,null,null,null,null,null,null,997.5,21.018325000000001,19.893757525951557,9,-3.1247499999999491,null,null,null,null,null,null,null,null,null,null,null,null,null,null,997.5,20.664999999999999,19.481979819067501,9,2.5800699999999779]
[null,null,null,null,null,null,null,null,null,null,null,null,null,null,null,null,997.75,20.962142499999999,19.837575025951558,9.1,-3.1266705799999954,null,null,null,null,null,null,null,null,null,null,null,null,null,null,997.75,20.611000000000001,19.427979819067502,9.1,2.588561039999945]
[null,null,null,null,null,null,null,null,null,null,null,null,null,null,null,null,998,20.90596,19.781392525951556,9.1999999999999993,-3.1282458399999769,null,null,null,null,null,null,null,null,null,null,null,null,null,null,998,20.557000000000002,19.373979819067504,9.1999999999999993,2.5971103199999561]
[null,null,null,null,null,null,null,null,null,null,null,null,null,null,null,null,998.25,20.849777499999998,19.725210025951554,9.3000000000000007,-3.1294780599999967,null,null,null,null,null,null,null,null,null,null,null,null,null,null,998.25,20.503,19.319979819067502,9.3000000000000007,2.6057180799999742]
[null,null,null,null,null,null,null,null,null,null,null,null,null,null,null,null,998.5,20.793595,19.669027525951556,9.4,-3.1303695200000448,null,null,null,null,null,null,null,null,null,null,null,null,null,null,998.5,20.449000000000002,19.265979819067503,9.4,2.6143845599999622]
[null,null,null,null,null,null,null,null,null,null,null,null,null,null,null,null,998.75,20.737412500000001,19.612845025951557,9.5,-3.1309224999999969,null,null,null,null,null,null,null,null,null,null,null,null,null,null,998.75,20.395,19.211979819067501,9.5,2.6231099999999969]
[null,null,null,null,null,null,null,null,null,null,null,null,null,null,null,null,999,20.681229999999999,19.556662525951559,9.6,-3.1311392799999567,null,null,null,null,null,null,null,null,null,null,null,null,null,null,999,20.341000000000001,19.157979819067503,9.6,2.6318946400000414]
[null,null,null,null,null,null,null,null,null,null,null,null,null,null,null,null,999.25,20.625047500000001,19.500480025951557,9.6999999999999993,-3.1310221400000273,null,null,null,null,null,null,null,null,null,null,null,null,null,null,999.25,20.286999999999999,19.103979819067501,9.6999999999999993,2.6407387199999448]
[null,null,null,null,null,null,null,null,null,null,null,null,null,null,null,null,999.5,20.568864999999999,19.444297525951555,9.7999999999999901,-3.1305733599999712,null,null,null,null,null,null,null,null,null,null,null,null,null,null,999.5,20.233000000000001,19.049979819067502,9.7999999999999901,2.6496424800000113]
[null,null,null,null,null,null,null,null,null,null,null,null,null,null,null,null,999.75,20.5126825,19.388115025951556,9.8999999999999897,-3.1297952200000054,null,null,null,null,null,null,null,null,null,null,null,null,null,null,999.75,20.179000000000002,18.995979819067504,9.8999999999999897,2.6586061599999766]
[null,null,null,null,null,null,null,null,null,null,null,null,null,null,null,null,1000,20.456500000000002,19.331932525951558,10,-3.128690000000006,null,null,null,null,null,null,null,null,null,null,null,null,null,null,1000,20.125,18.941979819067502,10,2.667630000000031]
[null,null,null,null,null,null,null,null,null,null,null,null,null,null,null,null,1000.25,20.4003175,19.27575002595156,10.1,-3.1272599799999625,null,null,null,null,null,null,null,null,null,null,null,null,null,null,1000.25,20.071000000000002,18.887979819067503,10.1,2.6767142400000239]
[null,null,null,null,null,null,null,null,null,null,null,null,null,null,null,null,1000.5,20.344134999999998,19.219567525951554,10.199999999999999,-3.1255074399999785,null,null,null,null,null,null,null,null,null,null,null,null,null,null,1000.5,20.016999999999999,18.833979819067501,10.199999999999999,2.6858591200000319]
[null,null,null,null,null,null,null,null,null,null,null,null,null,null,null,null,1000.75,20.287952499999999,19.163385025951555,10.3,-3.1234346600000436,null,null,null,null,null,null,null,null,null,null,null,null,null,null,1000.75,19.963000000000001,18.779979819067503,10.3,2.6950648800000181]
[null,null,null,null,null,null,null,null,null,null,null,null,null,null,null,null,1001,20.231770000000001,19.107202525951557,10.4,-3.1210439200000337,null,null,null,null,null,null,null,null,null,null,null,null,null,null,1001,19.908999999999999,18.725979819067501,10.4,2.7043317599999455]
[null,null,null,null,null,null,null,null,null,null,null,null,null,null,null,null,1001.25,20.175587499999999,19.051020025951559,10.5,-3.1183374999999387,null,null,null,null,null,null,null,null,null,null,null,null,null,null,1001.25,19.855,18.671979819067502,10.5,2.7136600000000044]
[null,null,null,null,null,null,null,null,null,null,null,null,null,null,null,null,1001.5,20.119405,18.994837525951557,10.6,-3.1153176799999756,null,null,null,null,null,null,null,null,null,null,null,null,null,null,1001.5,19.801000000000002,18.617979819067504,10.6,2.7230498400000442]
[null,null,null,null,null,null,null,null,null,null,null,null,null,null,null,null,1001.75,20.063222499999998,18.938655025951554,10.7,-3.1119867400000203,null,null,null,null,null,null,null,null,null,null,null,null,null,null,1001.75,19.747,18.563979819067502,10.7,2.732501520000028]
[null,null,null,null,null,null,null,null,null,null,null,null,null,null,null,null,1002,20.00704,18.882472525951556,10.8,-3.1083469599999489,null,null,null,null,null,null,null,null,null,null,null,null,null,null,1002,19.693000000000001,18.509979819067503,10.8,2.7420152800000324]
[null,null,null,null,null,null,null,null,null,null,null,null,null,null,null,null,1002.25,19.950857500000001,18.826290025951558,10.9,-3.1044006199999785,null,null,null,null,null,null,null,null,null,null,null,null,null,null,1002.25,19.638999999999999,18.455979819067501,10.9,2.7515913600000204]
[null,null,null,null,null,null,null,null,null,null,null,null,null,null,null,null,1002.5,19.894674999999999,18.770107525951559,11,-3.1001499999999851,null,null,null,null,null,null,null,null,null,null,null,null,null,null,1002.5,19.585000000000001,18.401979819067503,11,2.761229999999955]
[null,null,null,null,null,null,null,null,null,null,null,null,null,null,null,null,1002.75,19.838492500000001,18.713925025951557,11.1,-3.0955973799999583,null,null,null,null,null,null,null,null,null,null,null,null,null,null,1002.75,19.530999999999999,18.347979819067501,11.1,2.7709314400000267]
[null,null,null,null,null,null,null,null,null,null,null,null,null,null,null,null,1003,19.782309999999999,18.657742525951555,11.2,-3.0907450400000016,null,null,null,null,null,null,null,null,null,null,null,null,null,null,1003,19.477,18.293979819067502,11.2,2.780695919999971]
[null,null,null,null,null,null,null,null,null,null,null,null,null,null,null,null,1003.25,19.7261275,18.601560025951557,11.3,-3.085595259999991,null,null,null,null,null,null,null,null,null,null,null,null,null,null,1003.25,19.423000000000002,18.239979819067504,11.3,2.7905236799999784]
[null,null,null,null,null,null,null,null,null,null,null,null,null,null,null,null,1003.5,19.669945000000002,18.545377525951558,11.4,-3.0801503200000298,null,null,null,null,null,null,null,null,null,null,null,null,null,null,1003.5,19.369,18.185979819067501,11.4,2.8004149600000119]
[null,null,null,null,null,null,null,null,null,null,null,null,null,null,null,null,1003.75,19.6137625,18.489195025951556,11.5,-3.074412499999994,null,null,null,null,null,null,null,null,null,null,null,null,null,null,1003.75,19.315000000000001,18.131979819067503,11.5,2.8103700000000345]
[null,null,null,null,null,null,null,null,null,null,null,null,null,null,null,null,1004,19.557579999999998,18.433012525951554,11.6,-3.0683840799999871,null,null,null,null,null,null,null,null,null,null,null,null,null,null,1004,19.261000000000003,18.077979819067505,11.6,2.8203890400000091]
[null,null,null,null,null,null,null,null,null,null,null,null,null,null,null,null,1004.25,19.501397499999999,18.376830025951556,11.7,-3.0620673399999987,null,null,null,null,null,null,null,null,null,null,null,null,null,null,1004.25,19.207000000000001,18.023979819067502,11.7,2.8304723200000126]
[null,null,null,null,null,null,null,null,null,null,null,null,null,null,null,null,1004.5,19.445215000000001,18.320647525951557,11.8,-3.0554645600000185,null,null,null,null,null,null,null,null,null,null,null,null,null,null,1004.5,19.152999999999999,17.9699798190675,11.8,2.8406200800000079]
[null,null,null,null,null,null,null,null,null,null,null,null,null,null,null,null,1004.75,19.389032499999999,18.264465025951559,11.9,-3.0485780200000363,null,null,null,null,null,null,null,null,null,null,null,null,null,null,1004.75,19.099,17.915979819067502,11.9,2.850832559999958]
[null,null,null,null,null,null,null,null,null,null,null,null,null,null,null,null,1005,19.332850000000001,18.208282525951557,12,-3.0414100000000417,null,null,null,null,null,null,null,null,null,null,null,null,null,null,1005,19.045000000000002,17.861979819067503,12,2.8611099999999396]
[null,null,null,null,null,null,null,null,null,null,null,null,null,null,null,null,1005.25,19.276667499999999,18.152100025951555,12.1,-3.0339627800000244,null,null,null,null,null,null,null,null,null,null,null,null,null,null,1005.25,18.991,17.807979819067501,12.1,2.8714526400000295]
[null,null,null,null,null,null,null,null,null,null,null,null,null,null,null,null,1005.5,19.220485,18.095917525951556,12.2,-3.0262386399999741,null,null,null,null,null,null,null,null,null,null,null,null,null,null,1005.5,18.937000000000001,17.753979819067503,12.2,2.8818607199999633]
[null,null,null,null,null,null,null,null,null,null,null,null,null,null,null,null,1005.75,19.164302500000002,18.039735025951558,12.3,-3.0182398599999942,null,null,null,null,null,null,null,null,null,null,null,null,null,null,1005.75,18.883000000000003,17.699979819067504,12.3,2.8923344799999313]
[null,null,null,null,null,null,null,null,null,null,null,null,null,null,null,null,1006,19.10812,17.983552525951559,12.4,-3.0099687199999607,null,null,null,null,null,null,null,null,null,null,null,null,null,null,1006,18.829000000000001,17.645979819067502,12.4,2.9028741600000103]
[null,null,null,null,null,null,null,null,null,null,null,null,null,null,null,null,1006.25,19.051937500000001,17.927370025951557,12.5,-3.001427499999977,null,null,null,null,null,null,null,null,null,null,null,null,null,null,1006.25,18.774999999999999,17.5919798190675,12.5,2.9134799999999359]
[null,null,null,null,null,null,null,null,null,null,null,null,null,null,null,null,1006.5,18.995754999999999,17.871187525951555,12.6,-2.9926184800000328,null,null,null,null,null,null,null,null,null,null,null,null,null,null,1006.5,18.721,17.537979819067502,12.6,2.9241522400000122]
[null,null,null,null,null,null,null,null,null,null,null,null,null,null,null,null,1006.75,18.939572500000001,17.815005025951557,12.7,-2.9835439400000041,null,null,null,null,null,null,null,null,null,null,null,null,null,null,1006.75,18.667000000000002,17.483979819067503,12.7,2.9348911199999748]
[null,null,null,null,null,null,null,null,null,null,null,null,null,null,null,null,1007,18.883389999999999,17.758822525951558,12.8,-2.9742061599999943,null,null,null,null,null,null,null,null,null,null,null,null,null,null,1007,18.613,17.429979819067501,12.8,2.9456968800000141]
[null,null,null,null,null,null,null,null,null,null,null,null,null,null,null,null,1007.25,18.8272075,17.702640025951556,12.9,-2.964607419999993,null,null,null,null,null,null,null,null,null,null,null,null,null,null,1007.25,18.559000000000001,17.375979819067503,12.9,2.9565697599999794]
[null,null,null,null,null,null,null,null,null,null,null,null,null,null,null,null,1007.5,18.771024999999998,17.646457525951554,13,-2.95474999999999,null,null,null,null,null,null,null,null,null,null,null,null,null,null,1007.5,18.505000000000003,17.321979819067504,13,2.9675099999999475]
[null,null,null,null,null,null,null,null,null,null,null,null,null,null,null,null,1007.75,18.7148425,17.590275025951556,13.1,-2.944636179999975,null,null,null,null,null,null,null,null,null,null,null,null,null,null,1007.75,18.451000000000001,17.267979819067502,13.1,2.978517839999995]
[null,null,null,null,null,null,null,null,null,null,null,null,null,null,null,null,1008,18.658660000000001,17.534092525951557,13.2,-2.9342682399999376,null,null,null,null,null,null,null,null,null,null,null,null,null,null,1008,18.396999999999998,17.2139798190675,13.2,2.9895935199999712]
[null,null,null,null,null,null,null,null,null,null,null,null,null,null,null,null,1008.25,18.602477499999999,17.477910025951559,13.3,-2.9236484599999812,null,null,null,null,null,null,null,null,null,null,null,null,null,null,1008.25,18.343,17.159979819067502,13.3,3.000737279999953]
[null,null,null,null,null,null,null,null,null,null,null,null,null,null,null,null,1008.5,18.546295000000001,17.421727525951557,13.4,-2.912779119999982,null,null,null,null,null,null,null,null,null,null,null,null,null,null,1008.5,18.289000000000001,17.105979819067503,13.4,3.0119493600000169]
[null,null,null,null,null,null,null,null,null,null,null,null,null,null,null,null,1008.75,18.490112499999999,17.365545025951555,13.5,-2.9016625000000431,null,null,null,null,null,null,null,null,null,null,null,null,null,null,1008.75,18.234999999999999,17.051979819067501,13.5,3.0232300000000123]
[null,null,null,null,null,null,null,null,null,null,null,null,null,null,null,null,1009,18.43393,17.309362525951556,13.6,-2.8903008800000407,null,null,null,null,null,null,null,null,null,null,null,null,null,null,1009,18.181000000000001,16.997979819067503,13.6,3.0345794400000159]
[null,null,null,null,null,null,null,null,null,null,null,null,null,null,null,null,1009.25,18.377747500000002,17.253180025951558,13.7,-2.8786965399999644,null,null,null,null,null,null,null,null,null,null,null,null,null,null,1009.25,18.127000000000002,16.943979819067504,13.7,3.0459979199999907]
[null,null,null,null,null,null,null,null,null,null,null,null,null,null,null,null,1009.5,18.321565,17.196997525951559,13.8,-2.8668517600000314,null,null,null,null,null,null,null,null,null,null,null,null,null,null,1009.5,18.073,16.889979819067502,13.8,3.0574856800000134]
[null,null,null,null,null,null,null,null,null,null,null,null,null,null,null,null,1009.75,18.265382500000001,17.140815025951557,13.9,-2.8547688200000039,null,null,null,null,null,null,null,null,null,null,null,null,null,null,1009.75,18.019000000000002,16.835979819067504,13.9,3.0690429599999334]
[null,null,null,null,null,null,null,null,null,null,null,null,null,null,null,null,1010,18.209199999999999,17.084632525951555,14,-2.8424499999999853,null,null,null,null,null,null,null,null,null,null,null,null,null,null,1010,17.965,16.781979819067502,14,3.080669999999941]
[null,null,null,null,null,null,null,null,null,null,null,null,null,null,null,null,1010.25,18.153017500000001,17.028450025951557,14.1,-2.8298975799999653,null,null,null,null,null,null,null,null,null,null,null,null,null,null,1010.25,17.911000000000001,16.727979819067503,14.1,3.0923670399999992]
[null,null,null,null,null,null,null,null,null,null,null,null,null,null,null,null,1010.5,18.096834999999999,16.972267525951558,14.2,-2.8171138400000473,null,null,null,null,null,null,null,null,null,null,null,null,null,null,1010.5,17.856999999999999,16.673979819067501,14.2,3.1041343199999574]
[null,null,null,null,null,null,null,null,null,null,null,null,null,null,null,null,1010.75,18.0406525,16.916085025951556,14.3,-2.8041010599999936,null,null,null,null,null,null,null,null,null,null,null,null,null,null,1010.75,17.803000000000001,16.619979819067503,14.3,3.1159720800000059]
[null,null,null,null,null,null,null,null,null,null,null,null,null,null,null,null,1011,17.984469999999998,16.859902525951554,14.4,-2.7908615200000213,null,null,null,null,null,null,null,null,null,null,null,null,null,null,1011,17.749000000000002,16.565979819067504,14.4,3.1278805599999941]
[null,null,null,null,null,null,null,null,null,null,null,null,null,null,null,null,1011.25,17.9282875,16.803720025951556,14.5,-2.7773975000000064,null,null,null,null,null,null,null,null,null,null,null,null,null,null,1011.25,17.695,16.511979819067502,14.5,3.1398599999999988]
[null,null,null,null,null,null,null,null,null,null,null,null,null,null,null,null,1011.5,17.872105000000001,16.747537525951557,14.6,-2.7637112799999386,null,null,null,null,null,null,null,null,null,null,null,null,null,null,1011.5,17.641000000000002,16.457979819067504,14.6,3.1519106399999828]
[null,null,null,null,null,null,null,null,null,null,null,null,null,null,null,null,1011.75,17.815922499999999,16.691355025951559,14.7,-2.749805140000035,null,null,null,null,null,null,null,null,null,null,null,null,null,null,1011.75,17.587,16.403979819067501,14.7,3.1640327200000229]
[null,null,null,null,null,null,null,null,null,null,null,null,null,null,null,null,1012,17.759740000000001,16.635172525951557,14.8,-2.7356813599999441,null,null,null,null,null,null,null,null,null,null,null,null,null,null,1012,17.533000000000001,16.349979819067503,14.8,3.1762264799999684]
[null,null,null,null,null,null,null,null,null,null,null,null,null,null,null,null,1012.25,17.703557499999999,16.578990025951555,14.9,-2.7213422199999968,null,null,null,null,null,null,null,null,null,null,null,null,null,null,1012.25,17.478999999999999,16.295979819067501,14.9,3.1884921600000098]
[null,null,null,null,null,null,null,null,null,null,null,null,null,null,null,null,1012.5,17.647375,16.522807525951556,15,-2.7067899999999554,null,null,null,null,null,null,null,null,null,null,null,null,null,null,1012.5,17.425000000000001,16.241979819067502,15,3.2008299999999963]
[null,null,null,null,null,null,null,null,null,null,null,null,null,null,null,null,1012.75,17.591192500000002,16.466625025951558,15.1,-2.6920269800000369,null,null,null,null,null,null,null,null,null,null,null,null,null,null,1012.75,17.371000000000002,16.187979819067504,15.1,3.2132402400000046]
[null,null,null,null,null,null,null,null,null,null,null,null,null,null,null,null,1013,17.53501,16.410442525951559,15.2,-2.6770554400000037,null,null,null,null,null,null,null,null,null,null,null,null,null,null,1013,17.317,16.133979819067502,15.2,3.2257231199999978]
[null,null,null,null,null,null,null,null,null,null,null,null,null,null,null,null,1013.25,17.478827499999998,16.354260025951554,15.3,-2.6618776599999592,null,null,null,null,null,null,null,null,null,null,null,null,null,null,1013.25,17.263000000000002,16.079979819067503,15.3,3.2382788799999389]
[null,null,null,null,null,null,null,null,null,null,null,null,null,null,null,null,1013.5,17.422644999999999,16.298077525951555,15.4,-2.6464959200000067,null,null,null,null,null,null,null,null,null,null,null,null,null,null,1013.5,17.209,16.025979819067501,15.4,3.2509077600000182]
[null,null,null,null,null,null,null,null,null,null,null,null,null,null,null,null,1013.75,17.366462500000001,16.241895025951557,15.5,-2.6309125000000222,null,null,null,null,null,null,null,null,null,null,null,null,null,null,1013.75,17.155000000000001,15.971979819067503,15.5,3.2636099999999715]
[null,null,null,null,null,null,null,null,null,null,null,null,null,null,null,null,1014,17.310279999999999,16.185712525951558,15.6,-2.6151296799999955,null,null,null,null,null,null,null,null,null,null,null,null,null,null,1014,17.100999999999999,15.917979819067501,15.6,3.276385839999989]
[null,null,null,null,null,null,null,null,null,null,null,null,null,null,null,null,1014.25,17.2540975,16.129530025951556,15.7,-2.5991497400000299,null,null,null,null,null,null,null,null,null,null,null,null,null,null,1014.25,17.047000000000001,15.863979819067502,15.7,3.2892355200000338]
[null,null,null,null,null,null,null,null,null,null,null,null,null,null,null,null,1014.5,17.197915000000002,16.073347525951558,15.8,-2.5829749600000014,null,null,null,null,null,null,null,null,null,null,null,null,null,null,1014.5,16.993000000000002,15.809979819067504,15.8,3.3021592799999553]
[null,null,null,null,null,null,null,null,null,null,null,null,null,null,null,null,1014.75,17.1417325,16.017165025951556,15.9,-2.5666076200000134,null,null,null,null,null,null,null,null,null,null,null,null,null,null,1014.75,16.939,15.755979819067502,15.9,3.3151573599999438]
[null,null,null,null,null,null,null,null,null,null,null,null,null,null,null,null,1015,17.085550000000001,15.960982525951557,16,-2.550049999999942,null,null,null,null,null,null,null,null,null,null,null,null,null,null,1015,16.885000000000002,15.701979819067503,16,3.3282299999999623]
[null,null,null,null,null,null,null,null,null,null,null,null,null,null,null,null,1015.25,17.029367499999999,15.904800025951557,16.100000000000001,-2.5333043800000041,null,null,null,null,null,null,null,null,null,null,null,null,null,null,1015.25,16.831,15.647979819067501,16.100000000000001,3.3413774399999738]
[null,null,null,null,null,null,null,null,null,null,null,null,null,null,null,null,1015.5,16.973185000000001,15.848617525951557,16.2,-2.5163730399999622,null,null,null,null,null,null,null,null,null,null,null,null,null,null,1015.5,16.777000000000001,15.593979819067503,16.2,3.3545999199999414]
[null,null,null,null,null,null,null,null,null,null,null,null,null,null,null,null,1015.75,16.917002500000002,15.792435025951558,16.3,-2.4992582600000333,null,null,null,null,null,null,null,null,null,null,null,null,null,null,1015.75,16.722999999999999,15.539979819067501,16.3,3.3678976799999418]
[null,null,null,null,null,null,null,null,null,null,null,null,null,null,null,null,1016,16.86082,15.736252525951558,16.399999999999999,-2.4819623199999796,null,null,null,null,null,null,null,null,null,null,null,null,null,null,1016,16.669,15.485979819067502,16.399999999999999,3.381270959999938]
[null,null,null,null,null,null,null,null,null,null,null,null,null,null,null,null,1016.25,16.804637500000002,15.680070025951558,16.5,-2.4644875000000184,null,null,null,null,null,null,null,null,null,null,null,null,null,null,1016.25,16.615000000000002,15.431979819067504,16.5,3.3947200000000066]
[null,null,null,null,null,null,null,null,null,null,null,null,null,null,null,null,1016.5,16.748455,15.623887525951556,16.600000000000001,-2.4468360800000255,null,null,null,null,null,null,null,null,null,null,null,null,null,null,1016.5,16.561,15.377979819067502,16.600000000000001,3.4082450399999971]
[null,null,null,null,null,null,null,null,null,null,null,null,null,null,null,null,1016.75,16.692272500000001,15.567705025951557,16.7,-2.4290103399999907,null,null,null,null,null,null,null,null,null,null,null,null,null,null,1016.75,16.507000000000001,15.323979819067503,16.7,3.421846319999986]
[null,null,null,null,null,null,null,null,null,null,null,null,null,null,null,null,1017,16.636089999999999,15.511522525951557,16.8,-2.4110125600000174,null,null,null,null,null,null,null,null,null,null,null,null,null,null,1017,16.452999999999999,15.269979819067501,16.8,3.4355240799999365]
[null,null,null,null,null,null,null,null,null,null,null,null,null,null,null,null,1017.25,16.579907500000001,15.455340025951557,16.899999999999999,-2.3928450199999816,null,null,null,null,null,null,null,null,null,null,null,null,null,null,1017.25,16.399000000000001,15.215979819067503,16.899999999999999,3.4492785600000389]
[null,null,null,null,null,null,null,null,null,null,null,null,null,null,null,null,1017.5,16.523724999999999,15.399157525951557,17,-2.3745099999999866,null,null,null,null,null,null,null,null,null,null,null,null,null,null,1017.5,16.344999999999999,15.161979819067501,17,3.4631100000000288]
[null,null,null,null,null,null,null,null,null,null,null,null,null,null,null,null,1017.75,16.4675425,15.342975025951556,17.100000000000001,-2.3560097800000221,null,null,null,null,null,null,null,null,null,null,null,null,null,null,1017.75,16.291,15.107979819067502,17.100000000000001,3.477018639999983]
[null,null,null,null,null,null,null,null,null,null,null,null,null,null,null,null,1018,16.411360000000002,15.286792525951558,17.2,-2.3373466399999643,null,null,null,null,null,null,null,null,null,null,null,null,null,null,1018,16.237000000000002,15.053979819067504,17.2,3.4910047199999781]
[null,null,null,null,null,null,null,null,null,null,null,null,null,null,null,null,1018.25,16.3551775,15.230610025951558,17.3,-2.3185228600000301,null,null,null,null,null,null,null,null,null,null,null,null,null,null,1018.25,16.183,14.999979819067502,17.3,3.5050684799999772]
[null,null,null,null,null,null,null,null,null,null,null,null,null,null,null,null,1018.5,16.298995000000001,15.174427525951558,17.399999999999999,-2.2995407199999818,null,null,null,null,null,null,null,null,null,null,null,null,null,null,1018.5,16.129000000000001,14.945979819067503,17.399999999999999,3.5192101599999432]
[null,null,null,null,null,null,null,null,null,null,null,null,null,null,null,null,1018.75,16.242812499999999,15.118245025951557,17.5,-2.2804025000000365,null,null,null,null,null,null,null,null,null,null,null,null,null,null,1018.75,16.074999999999999,14.891979819067501,17.5,3.533429999999953]
[null,null,null,null,null,null,null,null,null,null,null,null,null,null,null,null,1019,16.186630000000001,15.062062525951557,17.600000000000001,-2.2611104799999566,null,null,null,null,null,null,null,null,null,null,null,null,null,null,1019,16.021000000000001,14.837979819067503,17.600000000000001,3.5477282399999694]
[null,null,null,null,null,null,null,null,null,null,null,null,null,null,null,null,1019.25,16.130447500000002,15.005880025951559,17.7,-2.2416669399999591,null,null,null,null,null,null,null,null,null,null,null,null,null,null,1019.25,15.966999999999999,14.7839798190675,17.7,3.5621051199999556]
[null,null,null,null,null,null,null,null,null,null,null,null,null,null,null,null,1019.5,16.074265,14.949697525951558,17.8,-2.2220741600000338,null,null,null,null,null,null,null,null,null,null,null,null,null,null,1019.5,15.913,14.729979819067502,17.8,3.5765608799999882]
[null,null,null,null,null,null,null,null,null,null,null,null,null,null,null,null,1019.75,16.018082499999998,14.893515025951556,17.899999999999999,-2.2023344199999428,null,null,null,null,null,null,null,null,null,null,null,null,null,null,1019.75,15.859000000000002,14.675979819067503,17.899999999999999,3.5910957600000302]
[null,null,null,null,null,null,null,null,null,null,null,null,null,null,null,null,1020,15.9619,14.837332525951556,18,-2.1824500000000171,null,null,null,null,null,null,null,null,null,null,null,null,null,null,1020,15.805,14.621979819067501,18,3.6057100000000446]
[null,null,null,null,null,null,null,null,null,null,null,null,null,null,null,null,1020.25,15.905717500000002,14.781150025951558,18.100000000000001,-2.1624231800000189,null,null,null,null,null,null,null,null,null,null,null,null,null,null,1020.25,15.751000000000001,14.567979819067503,18.100000000000001,3.6204038399999945]
[null,null,null,null,null,null,null,null,null,null,null,null,null,null,null,null,1020.5,15.849534999999999,14.724967525951557,18.2,-2.1422562399999379,null,null,null,null,null,null,null,null,null,null,null,null,null,null,1020.5,15.696999999999999,14.513979819067501,18.2,3.6351775199999565]
[null,null,null,null,null,null,null,null,null,null,null,null,null,null,null,null,1020.75,15.793352500000001,14.668785025951557,18.3,-2.1219514599999911,null,null,null,null,null,null,null,null,null,null,null,null,null,null,1020.75,15.643000000000001,14.459979819067502,18.3,3.6500312800000074]
[null,null,null,null,null,null,null,null,null,null,null,null,null,null,null,null,1021,15.737169999999999,14.612602525951557,18.399999999999999,-2.101511119999941,null,null,null,null,null,null,null,null,null,null,null,null,null,null,1021,15.588999999999999,14.4059798190675,18.399999999999999,3.6649653599999965]
[null,null,null,null,null,null,null,null,null,null,null,null,null,null,null,null,1021.25,15.680987500000001,14.556420025951557,18.5,-2.0809375000000045,null,null,null,null,null,null,null,null,null,null,null,null,null,null,1021.25,15.535,14.351979819067502,18.5,3.6799800000000005]
[null,null,null,null,null,null,null,null,null,null,null,null,null,null,null,null,1021.5,15.624805,14.500237525951558,18.600000000000001,-2.0602328799999441,null,null,null,null,null,null,null,null,null,null,null,null,null,null,1021.5,15.481,14.297979819067502,18.600000000000001,3.6950754399999823]
[null,null,null,null,null,null,null,null,null,null,null,null,null,null,null,null,1021.75,15.5686225,14.444055025951556,18.7,-2.0393995399999767,null,null,null,null,null,null,null,null,null,null,null,null,null,null,1021.75,15.427,14.243979819067501,18.7,3.7102519200000188]
[null,null,null,null,null,null,null,null,null,null,null,null,null,null,null,null,1022,15.512440000000002,14.387872525951558,18.8,-2.0184397599999784,null,null,null,null,null,null,null,null,null,null,null,null,null,null,1022,15.372999999999999,14.189979819067501,18.8,3.7255096799999592]
[null,null,null,null,null,null,null,null,null,null,null,null,null,null,null,null,1022.25,15.4562575,14.331690025951556,18.899999999999999,-1.9973558199999388,null,null,null,null,null,null,null,null,null,null,null,null,null,null,1022.25,15.318999999999999,14.135979819067501,18.899999999999999,3.7408489599999939]
[null,null,null,null,null,null,null,null,null,null,null,null,null,null,null,null,1022.5,15.400075000000001,14.275507525951557,19,-1.9761499999999614,null,null,null,null,null,null,null,null,null,null,null,null,null,null,1022.5,15.265000000000001,14.081979819067502,19,3.7562699999999722]
[null,null,null,null,null,null,null,null,null,null,null,null,null,null,null,null,1022.75,15.343892499999999,14.219325025951557,19.100000000000001,-1.9548245800000359,null,null,null,null,null,null,null,null,null,null,null,null,null,null,1022.75,15.211,14.027979819067502,19.100000000000001,3.7717730399999709]
[null,null,null,null,null,null,null,null,null,null,null,null,null,null,null,null,1023,15.287710000000001,14.163142525951557,19.2,-1.9333818399999245,null,null,null,null,null,null,null,null,null,null,null,null,null,null,1023,15.157,13.973979819067502,19.2,3.787358319999953]
[null,null,null,null,null,null,null,null,null,null,null,null,null,null,null,null,1023.25,15.2315275,14.106960025951558,19.3,-1.9118240599999581,null,null,null,null,null,null,null,null,null,null,null,null,null,null,1023.25,15.103,13.919979819067501,19.3,3.8030260799999951]
[null,null,null,null,null,null,null,null,null,null,null,null,null,null,null,null,1023.5,15.175345,14.050777525951556,19.399999999999999,-1.8901535200000126,null,null,null,null,null,null,null,null,null,null,null,null,null,null,1023.5,15.048999999999999,13.865979819067501,19.399999999999999,3.8187765599999466]
[null,null,null,null,null,null,null,null,null,null,null,null,null,null,null,null,1023.75,15.1191625,13.994595025951558,19.5,-1.868372499999964,null,null,null,null,null,null,null,null,null,null,null,null,null,null,1023.75,14.994999999999999,13.811979819067501,19.5,3.8346099999999979]
[null,null,null,null,null,null,null,null,null,null,null,null,null,null,null,null,1024,15.06298,13.938412525951556,19.600000000000001,-1.8464832800000295,null,null,null,null,null,null,null,null,null,null,null,null,null,null,1024,14.940999999999999,13.757979819067501,19.600000000000001,3.8505266399999982]
[null,null,null,null,null,null,null,null,null,null,null,null,null,null,null,null,1024.25,15.006797500000001,13.882230025951557,19.7,-1.8244881399999713,null,null,null,null,null,null,null,null,null,null,null,null,null,null,1024.25,14.887,13.703979819067502,19.7,3.8665267200000244]
[null,null,null,null,null,null,null,null,null,null,null,null,null,null,null,null,1024.5,14.950614999999999,13.826047525951557,19.8,-1.8023893600000065,null,null,null,null,null,null,null,null,null,null,null,null,null,null,1024.5,14.833,13.649979819067502,19.8,3.8826104800000394]
[null,null,null,null,null,null,null,null,null,null,null,null,null,null,null,null,1024.75,14.894432500000001,13.769865025951557,19.899999999999999,-1.7801892200000111,null,null,null,null,null,null,null,null,null,null,null,null,null,null,1024.75,14.779,13.595979819067502,19.899999999999999,3.8987781600000062]
[null,null,null,null,null,null,null,null,null,null,null,null,null,null,null,null,1025,14.83825,13.713682525951558,20,-1.7578899999999749,null,null,null,null,null,null,null,null,null,null,null,null,null,null,1025,14.725,13.541979819067501,20,3.9150300000000016]
[null,null,null,null,null,null,null,null,null,null,null,null,null,null,null,null,1025.25,14.7820675,13.657500025951556,20.100000000000001,-1.7354939800000011,null,null,null,null,null,null,null,null,null,null,null,null,null,null,1025.25,14.670999999999999,13.487979819067501,20.100000000000001,3.9313662399999885]
[null,null,null,null,null,null,null,null,null,null,null,null,null,null,null,null,1025.5,14.725885,13.601317525951558,20.2,-1.7130034399999658,null,null,null,null,null,null,null,null,null,null,null,null,null,null,1025.5,14.616999999999999,13.433979819067501,20.2,3.9477871200000436]
[null,null,null,null,null,null,null,null,null,null,null,null,null,null,null,null,1025.75,14.6697025,13.545135025951556,20.3,-1.6904206599999725,null,null,null,null,null,null,null,null,null,null,null,null,null,null,1025.75,14.562999999999999,13.379979819067501,20.3,3.9642928800000163]
[null,null,null,null,null,null,null,null,null,null,null,null,null,null,null,null,1026,14.613520000000001,13.488952525951557,20.399999999999999,-1.6677479200000107,null,null,null,null,null,null,null,null,null,null,null,null,null,null,1026,14.509,13.325979819067502,20.399999999999999,3.9808837599999833]
[null,null,null,null,null,null,null,null,null,null,null,null,null,null,null,null,1026.25,14.557337499999999,13.432770025951557,20.5,-1.6449874999999565,null,null,null,null,null,null,null,null,null,null,null,null,null,null,1026.25,14.455,13.271979819067502,20.5,3.9975600000000213]
[null,null,null,null,null,null,null,null,null,null,null,null,null,null,null,null,1026.5,14.501155000000001,13.376587525951557,20.6,-1.622141680000027,null,null,null,null,null,null,null,null,null,null,null,null,null,null,1026.5,14.401,13.217979819067502,20.6,4.0143218399999796]
[null,null,null,null,null,null,null,null,null,null,null,null,null,null,null,null,1026.75,14.4449725,13.320405025951558,20.7,-1.5992127399999845,null,null,null,null,null,null,null,null,null,null,null,null,null,null,1026.75,14.347,13.163979819067501,20.7,4.0311695200000486]
[null,null,null,null,null,null,null,null,null,null,null,null,null,null,null,null,1027,14.38879,13.264222525951556,20.8,-1.5762029599999323,null,null,null,null,null,null,null,null,null,null,null,null,null,null,1027,14.292999999999999,13.109979819067501,20.8,4.0481032799999639]
[null,null,null,null,null,null,null,null,null,null,null,null,null,null,null,null,1027.25,14.3326075,13.208040025951558,20.9,-1.5531146199999739,null,null,null,null,null,null,null,null,null,null,null,null,null,null,1027.25,14.238999999999999,13.055979819067501,20.9,4.0651233600000296]
[null,null,null,null,null,null,null,null,null,null,null,null,null,null,null,null,1027.5,14.276425,13.151857525951556,21,-1.5299499999999853,null,null,null,null,null,null,null,null,null,null,null,null,null,null,1027.5,14.184999999999999,13.0019798190675,21,4.0822299999999814]
[null,null,null,null,null,null,null,null,null,null,null,null,null,null,null,null,1027.75,14.220242500000001,13.095675025951557,21.1,-1.5067113799999561,null,null,null,null,null,null,null,null,null,null,null,null,null,null,1027.75,14.131,12.947979819067502,21.1,4.0994234400000096]
[null,null,null,null,null,null,null,null,null,null,null,null,null,null,null,null,1028,14.164059999999999,13.039492525951557,21.2,-1.4834010399999897,null,null,null,null,null,null,null,null,null,null,null,null,null,null,1028,14.077,12.893979819067502,21.2,4.1167039199999635]
[null,null,null,null,null,null,null,null,null,null,null,null,null,null,null,null,1028.25,14.107877500000001,12.983310025951557,21.3,-1.4600212599999622,null,null,null,null,null,null,null,null,null,null,null,null,null,null,1028.25,14.023,12.839979819067501,21.3,4.1340716800000337]
[null,null,null,null,null,null,null,null,null,null,null,null,null,null,null,null,1028.5,14.051694999999999,12.927127525951557,21.4,-1.436574319999977,null,null,null,null,null,null,null,null,null,null,null,null,null,null,1028.5,13.968999999999999,12.785979819067501,21.4,4.1515269599999556]
[null,null,null,null,null,null,null,null,null,null,null,null,null,null,null,null,1028.75,13.9955125,12.870945025951556,21.5,-1.4130625000000236,null,null,null,null,null,null,null,null,null,null,null,null,null,null,1028.75,13.914999999999999,12.731979819067501,21.5,4.1690700000000334]
[null,null,null,null,null,null,null,null,null,null,null,null,null,null,null,null,1029,13.93933,12.814762525951558,21.6,-1.3894880799999783,null,null,null,null,null,null,null,null,null,null,null,null,null,null,1029,13.860999999999999,12.677979819067501,21.6,4.1867010400000026]
[null,null,null,null,null,null,null,null,null,null,null,null,null,null,null,null,1029.25,13.8831475,12.758580025951556,21.7,-1.3658533399999442,null,null,null,null,null,null,null,null,null,null,null,null,null,null,1029.25,13.806999999999999,12.6239798190675,21.7,4.2044203200000538]
[null,null,null,null,null,null,null,null,null,null,null,null,null,null,null,null,1029.5,13.826965000000001,12.702397525951557,21.8,-1.3421605600000248,null,null,null,null,null,null,null,null,null,null,null,null,null,null,1029.5,13.753,12.569979819067502,21.8,4.2222280800000362]
[null,null,null,null,null,null,null,null,null,null,null,null,null,null,null,null,1029.75,13.770782499999999,12.646215025951557,21.9,-1.3184120199999825,null,null,null,null,null,null,null,null,null,null,null,null,null,null,1029.75,13.699,12.515979819067502,21.9,4.2401245600000266]
[null,null,null,null,null,null,null,null,null,null,null,null,null,null,null,null,1030,13.714600000000001,12.590032525951557,22,-1.2946100000000342,null,null,null,null,null,null,null,null,null,null,null,null,null,null,1030,13.645,12.461979819067501,22,4.2581099999999878]
[null,null,null,null,null,null,null,null,null,null,null,null,null,null,null,null,1030.25,13.658417499999999,12.533850025951557,22.1,-1.2707567799999424,null,null,null,null,null,null,null,null,null,null,null,null,null,null,1030.25,13.590999999999999,12.407979819067501,22.1,4.2761846399999968]
[null,null,null,null,null,null,null,null,null,null,null,null,null,null,null,null,1030.5,13.602235,12.477667525951556,22.2,-1.2468546400000378,null,null,null,null,null,null,null,null,null,null,null,null,null,null,1030.5,13.536999999999999,12.353979819067501,22.2,4.2943487200000163]
[null,null,null,null,null,null,null,null,null,null,null,null,null,null,null,null,1030.75,13.5460525,12.421485025951558,22.3,-1.2229058599999689,null,null,null,null,null,null,null,null,null,null,null,null,null,null,1030.75,13.483000000000001,12.299979819067502,22.3,4.3126024800000096]
[null,null,null,null,null,null,null,null,null,null,null,null,null,null,null,null,1031,13.48987,12.365302525951556,22.4,-1.198912719999953,null,null,null,null,null,null,null,null,null,null,null,null,null,null,1031,13.429,12.245979819067502,22.4,4.3309461599999395]
[null,null,null,null,null,null,null,null,null,null,null,null,null,null,null,null,1031.25,13.433687500000001,12.309120025951557,22.5,-1.1748774999999796,null,null,null,null,null,null,null,null,null,null,null,null,null,null,1031.25,13.375,12.191979819067502,22.5,4.3493799999999965]
[null,null,null,null,null,null,null,null,null,null,null,null,null,null,null,null,1031.5,13.377504999999999,12.252937525951557,22.6,-1.1508024800000385,null,null,null,null,null,null,null,null,null,null,null,null,null,null,1031.5,13.321,12.137979819067501,22.6,4.3679042400000299]
[null,null,null,null,null,null,null,null,null,null,null,null,null,null,null,null,1031.75,13.321322500000001,12.196755025951557,22.7,-1.1266899400000057,null,null,null,null,null,null,null,null,null,null,null,null,null,null,1031.75,13.266999999999999,12.083979819067501,22.7,4.3865191200000027]
[null,null,null,null,null,null,null,null,null,null,null,null,null,null,null,null,1032,13.265139999999999,12.140572525951557,22.8,-1.1025421599999845,null,null,null,null,null,null,null,null,null,null,null,null,null,null,1032,13.213000000000001,12.029979819067503,22.8,4.4052248799999916]
[null,null,null,null,null,null,null,null,null,null,null,null,null,null,null,null,1032.25,13.2089575,12.084390025951556,22.9,-1.0783614199999647,null,null,null,null,null,null,null,null,null,null,null,null,null,null,1032.25,13.158999999999999,11.975979819067501,22.9,4.4240217599999596]
[null,null,null,null,null,null,null,null,null,null,null,null,null,null,null,null,1032.5,13.152775,12.028207525951558,23,-1.054149999999936,null,null,null,null,null,null,null,null,null,null,null,null,null,null,1032.5,13.105,11.921979819067502,23,4.4429099999999835]
[null,null,null,null,null,null,null,null,null,null,null,null,null,null,null,null,1032.75,13.0965925,11.972025025951556,23.1,-1.0299101800000017,null,null,null,null,null,null,null,null,null,null,null,null,null,null,1032.75,13.051,11.867979819067502,23.1,4.4618898400000262]
[null,null,null,null,null,null,null,null,null,null,null,null,null,null,null,null,1033,13.040410000000001,11.915842525951557,23.2,-1.0056442400000378,null,null,null,null,null,null,null,null,null,null,null,null,null,null,1033,12.997,11.813979819067502,23.2,4.4809615199999371]
[null,null,null,null,null,null,null,null,null,null,null,null,null,null,null,null,1033.25,12.984227499999999,11.859660025951555,23.3,-0.98135446000003412,null,null,null,null,null,null,null,null,null,null,null,null,null,null,1033.25,12.943,11.759979819067501,23.3,4.5001252800000202]
[null,null,null,null,null,null,null,null,null,null,null,null,null,null,null,null,1033.5,12.928045000000001,11.803477525951557,23.4,-0.95704311999998026,null,null,null,null,null,null,null,null,null,null,null,null,null,null,1033.5,12.888999999999999,11.705979819067501,23.4,4.5193813600000112]
[null,null,null,null,null,null,null,null,null,null,null,null,null,null,null,null,1033.75,12.871862499999999,11.747295025951557,23.5,-0.93271249999997963,null,null,null,null,null,null,null,null,null,null,null,null,null,null,1033.75,12.835000000000001,11.651979819067503,23.5,4.5387299999999868]
[null,null,null,null,null,null,null,null,null,null,null,null,null,null,null,null,1034,12.81568,11.691112525951556,23.6,-0.90836488000002191,null,null,null,null,null,null,null,null,null,null,null,null,null,null,1034,12.780999999999999,11.597979819067501,23.6,4.5581714400000237]
[null,null,null,null,null,null,null,null,null,null,null,null,null,null,null,null,1034.25,12.7594975,11.634930025951558,23.7,-0.88400253999998313,null,null,null,null,null,null,null,null,null,null,null,null,null,null,1034.25,12.727,11.543979819067502,23.7,4.5777059199999712]
[null,null,null,null,null,null,null,null,null,null,null,null,null,null,null,null,1034.5,12.703315,11.578747525951556,23.8,-0.85962775999996666,null,null,null,null,null,null,null,null,null,null,null,null,null,null,1034.5,12.673,11.489979819067502,23.8,4.5973336800000197]
[null,null,null,null,null,null,null,null,null,null,null,null,null,null,null,null,1034.75,12.647132500000001,11.522565025951558,23.9,-0.83524281999996219,null,null,null,null,null,null,null,null,null,null,null,null,null,null,1034.75,12.619,11.435979819067501,23.9,4.6170549600000186]
[null,null,null,null,null,null,null,null,null,null,null,null,null,null,null,null,1035,12.590949999999999,11.466382525951555,24,-0.81084999999995944,null,null,null,null,null,null,null,null,null,null,null,null,null,null,1035,12.565000000000001,11.381979819067503,24,4.6368700000000445]
[null,null,null,null,null,null,null,null,null,null,null,null,null,null,null,null,1035.25,12.534767500000001,11.410200025951557,24.1,-0.78645157999994808,null,null,null,null,null,null,null,null,null,null,null,null,null,null,1035.25,12.510999999999999,11.327979819067501,24.1,4.6567790399999467]
[null,null,null,null,null,null,null,null,null,null,null,null,null,null,null,null,1035.5,12.478584999999999,11.354017525951557,24.2,-0.76204984000003151,null,null,null,null,null,null,null,null,null,null,null,null,null,null,1035.5,12.457000000000001,11.273979819067502,24.2,4.6767823200000294]
[null,null,null,null,null,null,null,null,null,null,null,null,null,null,null,null,1035.75,12.4224025,11.297835025951557,24.3,-0.73764705999997204,null,null,null,null,null,null,null,null,null,null,null,null,null,null,1035.75,12.402999999999999,11.2199798190675,24.3,4.6968800800000281]
[null,null,null,null,null,null,null,null,null,null,null,null,null,null,null,null,1036,12.36622,11.241652525951558,24.4,-0.71324551999998675,null,null,null,null,null,null,null,null,null,null,null,null,null,null,1036,12.349,11.165979819067502,24.4,4.7170725600000196]
[null,null,null,null,null,null,null,null,null,null,null,null,null,null,null,null,1036.25,12.3100375,11.185470025951556,24.5,-0.68884749999995165,null,null,null,null,null,null,null,null,null,null,null,null,null,null,1036.25,12.295,11.111979819067502,24.5,4.7373599999999669]
[null,null,null,null,null,null,null,null,null,null,null,null,null,null,null,null,1036.5,12.253855,11.129287525951558,24.6,-0.66445527999997012,null,null,null,null,null,null,null,null,null,null,null,null,null,null,1036.5,12.241,11.057979819067501,24.6,4.7577426399999467]
[null,null,null,null,null,null,null,null,null,null,null,null,null,null,null,null,1036.75,12.197672499999999,11.073105025951557,24.7,-0.64007114000003185,null,null,null,null,null,null,null,null,null,null,null,null,null,null,1036.75,12.186999999999999,11.003979819067501,24.7,4.7782207200000357]
[null,null,null,null,null,null,null,null,null,null,null,null,null,null,null,null,1037,12.141490000000001,11.016922525951557,24.8,-0.61569736000001285,null,null,null,null,null,null,null,null,null,null,null,null,null,null,1037,12.132999999999999,10.949979819067501,24.8,4.7987944799999696]
[null,null,null,null,null,null,null,null,null,null,null,null,null,null,null,null,1037.25,12.085307499999999,10.960740025951557,24.9,-0.59133622000001651,null,null,null,null,null,null,null,null,null,null,null,null,null,null,1037.25,12.079000000000001,10.895979819067502,24.9,4.8194641600000523]
[null,null,null,null,null,null,null,null,null,null,null,null,null,null,null,null,1037.5,12.029125000000001,10.904557525951557,25,-0.56699000000003252,null,null,null,null,null,null,null,null,null,null,null,null,null,null,1037.5,12.024999999999999,10.8419798190675,25,4.8402300000000196]
[null,null,null,null,null,null,null,null,null,null,null,null,null,null,null,null,1037.75,11.9729425,10.848375025951558,25.1,-0.5426609799999369,null,null,null,null,null,null,null,null,null,null,null,null,null,null,1037.75,11.971,10.787979819067502,25.1,4.8610922399999481]
[null,null,null,null,null,null,null,null,null,null,null,null,null,null,null,null,1038,11.91676,10.792192525951556,25.2,-0.51835143999994671,null,null,null,null,null,null,null,null,null,null,null,null,null,null,1038,11.917,10.733979819067502,25.2,4.8820511200000283]
[null,null,null,null,null,null,null,null,null,null,null,null,null,null,null,null,1038.25,11.8605775,10.736010025951558,25.3,-0.49406365999993795,null,null,null,null,null,null,null,null,null,null,null,null,null,null,1038.25,11.863,10.679979819067501,25.3,4.9031068799999957]
[null,null,null,null,null,null,null,null,null,null,null,null,null,null,null,null,1038.5,11.804395,10.679827525951556,25.4,-0.46979992000001403,null,null,null,null,null,null,null,null,null,null,null,null,null,null,1038.5,11.809000000000001,10.625979819067503,25.4,4.9242597600000408]
[null,null,null,null,null,null,null,null,null,null,null,null,null,null,null,null,1038.75,11.748212500000001,10.623645025951557,25.5,-0.44556249999993724,null,null,null,null,null,null,null,null,null,null,null,null,null,null,1038.75,11.754999999999999,10.571979819067501,25.5,4.945510000000013]
[null,null,null,null,null,null,null,null,null,null,null,null,null,null,null,null,1039,11.692029999999999,10.567462525951557,25.6,-0.42135367999992468,null,null,null,null,null,null,null,null,null,null,null,null,null,null,1039,11.701000000000001,10.517979819067502,25.6,4.9668578399999888]
[null,null,null,null,null,null,null,null,null,null,null,null,null,null,null,null,1039.25,11.635847500000001,10.511280025951557,25.7,-0.39717573999996603,null,null,null,null,null,null,null,null,null,null,null,null,null,null,1039.25,11.646999999999998,10.4639798190675,25.7,4.988303520000045]
[null,null,null,null,null,null,null,null,null,null,null,null,null,null,null,null,1039.5,11.579665,10.455097525951558,25.8,-0.37303095999993729,null,null,null,null,null,null,null,null,null,null,null,null,null,null,1039.5,11.593,10.409979819067502,25.8,5.0098472800000309]
[null,null,null,null,null,null,null,null,null,null,null,null,null,null,null,null,1039.75,11.5234825,10.398915025951556,25.9,-0.34892161999994187,null,null,null,null,null,null,null,null,null,null,null,null,null,null,1039.75,11.539,10.355979819067501,25.9,5.0314893600000232]
[null,null,null,null,null,null,null,null,null,null,null,null,null,null,null,null,1040,11.4673,10.342732525951558,26,-0.32484999999996944,null,null,null,null,null,null,null,null,null,null,null,null,null,null,1040,11.484999999999999,10.301979819067501,26,5.053229999999985]
[null,null,null,null,null,null,null,null,null,null,null,null,null,null,null,null,1040.25,11.4111175,10.286550025951556,26.1,-0.30081838000000971,null,null,null,null,null,null,null,null,null,null,null,null,null,null,1040.25,11.431000000000001,10.247979819067503,26.1,5.0750694399999929]
[null,null,null,null,null,null,null,null,null,null,null,null,null,null,null,null,1040.5,11.354935000000001,10.230367525951557,26.2,-0.27682903999993869,null,null,null,null,null,null,null,null,null,null,null,null,null,null,1040.5,11.376999999999999,10.193979819067501,26.2,5.09700792000001]
[null,null,null,null,null,null,null,null,null,null,null,null,null,null,null,null,1040.75,11.298752499999999,10.174185025951557,26.3,-0.25288425999997344,null,null,null,null,null,null,null,null,null,null,null,null,null,null,1040.75,11.323,10.139979819067502,26.3,5.1190456799999993]
[null,null,null,null,null,null,null,null,null,null,null,null,null,null,null,null,1041,11.242570000000001,10.118002525951557,26.4,-0.22898631999998997,null,null,null,null,null,null,null,null,null,null,null,null,null,null,1041,11.269,10.085979819067502,26.4,5.1411829600000374]
[null,null,null,null,null,null,null,null,null,null,null,null,null,null,null,null,1041.25,11.1863875,10.061820025951558,26.5,-0.20513749999997799,null,null,null,null,null,null,null,null,null,null,null,null,null,null,1041.25,11.215,10.031979819067502,26.5,5.1634199999999737]
[null,null,null,null,null,null,null,null,null,null,null,null,null,null,null,null,1041.5,11.130205,10.005637525951556,26.6,-0.18134007999992718,null,null,null,null,null,null,null,null,null,null,null,null,null,null,1041.5,11.161,9.9779798190675013,26.6,5.1857570399999986]
[null,null,null,null,null,null,null,null,null,null,null,null,null,null,null,null,1041.75,11.0740225,9.9494550259515577,26.7,-0.15759633999994094,null,null,null,null,null,null,null,null,null,null,null,null,null,null,1041.75,11.106999999999999,9.923979819067501,26.7,5.2081943199999614]
[null,null,null,null,null,null,null,null,null,null,null,null,null,null,null,null,1042,11.01784,9.8932725259515575,26.8,-0.13390856000000895,null,null,null,null,null,null,null,null,null,null,null,null,null,null,1042,11.053000000000001,9.8699798190675025,26.8,5.2307320800000525]
[null,null,null,null,null,null,null,null,null,null,null,null,null,null,null,null,1042.25,10.961657500000001,9.8370900259515572,26.9,-0.11027902000000722,null,null,null,null,null,null,null,null,null,null,null,null,null,null,1042.25,10.998999999999999,9.8159798190675005,26.9,5.2533705600000076]
[null,null,null,null,null,null,null,null,null,null,null,null,null,null,null,null,1042.5,10.905474999999999,9.780907525951557,27,-8.6709999999925458E-2,null,null,null,null,null,null,null,null,null,null,null,null,null,null,1042.5,10.945,9.761979819067502,27,5.276110000000017]
[null,null,null,null,null,null,null,null,null,null,null,null,null,null,null,null,1042.75,10.849292500000001,9.7247250259515567,27.1,-6.3203779999980725E-2,null,null,null,null,null,null,null,null,null,null,null,null,null,null,1042.75,10.891,9.7079798190675017,27.1,5.2989506400000437]
[null,null,null,null,null,null,null,null,null,null,null,null,null,null,null,null,1043,10.79311,9.6685425259515583,27.2,-3.9762639999935345E-2,null,null,null,null,null,null,null,null,null,null,null,null,null,null,1043,10.837,9.6539798190675015,27.2,5.3218927200000508]
[null,null,null,null,null,null,null,null,null,null,null,null,null,null,null,null,1043.25,10.7369275,9.6123600259515563,27.3,-1.6388860000006389E-2,null,null,null,null,null,null,null,null,null,null,null,null,null,null,1043.25,10.782999999999999,9.5999798190675012,27.3,5.3449364800000012]
[null,null,null,null,null,null,null,null,null,null,null,null,null,null,null,null,1043.5,10.680745,9.5561775259515578,27.4,6.9152800000438219E-3,null,null,null,null,null,null,null,null,null,null,null,null,null,null,1043.5,10.728999999999999,9.5459798190675009,27.4,5.3680821599999717]
[null,null,null,null,null,null,null,null,null,null,null,null,null,null,null,null,1043.75,10.6245625,9.4999950259515575,27.5,3.0147499999998217E-2,null,null,null,null,null,null,null,null,null,null,null,null,null,null,1043.75,10.675000000000001,9.4919798190675024,27.5,5.391330000000039]
[null,null,null,null,null,null,null,null,null,null,null,null,null,null,null,null,1044,10.568380000000001,9.4438125259515573,27.6,5.3305519999980788E-2,null,null,null,null,null,null,null,null,null,null,null,null,null,null,1044,10.620999999999999,9.4379798190675004,27.6,5.4146802400000524]
[null,null,null,null,null,null,null,null,null,null,null,null,null,null,null,null,1044.25,10.512197499999999,9.387630025951557,27.7,7.6387060000001838E-2,null,null,null,null,null,null,null,null,null,null,null,null,null,null,1044.25,10.567,9.3839798190675019,27.7,5.438133119999975]
[null,null,null,null,null,null,null,null,null,null,null,null,null,null,null,null,1044.5,10.456015000000001,9.3314475259515568,27.8,9.9389840000071672E-2,null,null,null,null,null,null,null,null,null,null,null,null,null,null,1044.5,10.513,9.3299798190675016,27.8,5.461688879999997]
[null,null,null,null,null,null,null,null,null,null,null,null,null,null,null,null,1044.75,10.3998325,9.2752650259515566,27.9,0.12231158000008691,null,null,null,null,null,null,null,null,null,null,null,null,null,null,1044.75,10.459,9.2759798190675014,27.9,5.4853477599999678]
[null,null,null,null,null,null,null,null,null,null,null,null,null,null,null,null,1045,10.34365,9.2190825259515563,28,0.14515000000005784,null,null,null,null,null,null,null,null,null,null,null,null,null,null,1045,10.404999999999999,9.2219798190675011,28,5.5091099999999642]
[null,null,null,null,null,null,null,null,null,null,null,null,null,null,null,null,1045.25,10.2874675,9.1629000259515578,28.1,0.16790281999999479,null,null,null,null,null,null,null,null,null,null,null,null,null,null,1045.25,10.350999999999999,9.1679798190675008,28.1,5.5329758400000628]
[null,null,null,null,null,null,null,null,null,null,null,null,null,null,null,null,1045.5,10.231285,9.1067175259515558,28.2,0.19056776000002174,null,null,null,null,null,null,null,null,null,null,null,null,null,null,1045.5,10.297000000000001,9.1139798190675023,28.2,5.5569455199999993]
[null,null,null,null,null,null,null,null,null,null,null,null,null,null,null,null,1045.75,10.175102499999999,9.0505350259515573,28.299999999999901,0.2131425400000353,null,null,null,null,null,null,null,null,null,null,null,null,null,null,1045.75,10.242999999999999,9.0599798190675003,28.299999999999901,5.5810192799999641]
[null,null,null,null,null,null,null,null,null,null,null,null,null,null,null,null,1046,10.118919999999999,8.9943525259515571,28.399999999999899,0.23562488000004578,null,null,null,null,null,null,null,null,null,null,null,null,null,null,1046,10.189,9.0059798190675018,28.399999999999899,5.6051973600000338]
[null,null,null,null,null,null,null,null,null,null,null,null,null,null,null,null,1046.25,10.062737500000001,8.9381700259515569,28.499999999999901,0.25801250000006348,null,null,null,null,null,null,null,null,null,null,null,null,null,null,1046.25,10.135,8.9519798190675015,28.499999999999901,5.6294800000000578]
[null,null,null,null,null,null,null,null,null,null,null,null,null,null,null,null,1046.5,10.006555000000001,8.8819875259515566,28.599999999999898,0.28030311999998503,null,null,null,null,null,null,null,null,null,null,null,null,null,null,1046.5,10.081,8.8979798190675012,28.599999999999898,5.6538674399999991]
[null,null,null,null,null,null,null,null,null,null,null,null,null,null,null,null,1046.75,9.9503725000000003,8.8258050259515564,28.6999999999999,0.30249446000004809,null,null,null,null,null,null,null,null,null,null,null,null,null,null,1046.75,10.026999999999999,8.843979819067501,28.6999999999999,5.6783599200000481]
[null,null,null,null,null,null,null,null,null,null,null,null,null,null,null,null,1047,9.89419,8.7696225259515579,28.799999999999901,0.32458424000003561,null,null,null,null,null,null,null,null,null,null,null,null,null,null,1047,9.972999999999999,8.7899798190675007,28.799999999999901,5.7029576800000541]
[null,null,null,null,null,null,null,null,null,null,null,null,null,null,null,null,1047.25,9.8380074999999998,8.7134400259515559,28.899999999999899,0.34657018000007156,null,null,null,null,null,null,null,null,null,null,null,null,null,null,1047.25,9.9190000000000005,8.7359798190675022,28.899999999999899,5.7276609599999802]
[null,null,null,null,null,null,null,null,null,null,null,null,null,null,null,null,1047.5,9.7818249999999995,8.6572575259515574,28.999999999999901,0.36845000000005257,null,null,null,null,null,null,null,null,null,null,null,null,null,null,1047.5,9.8649999999999984,8.6819798190675002,28.999999999999901,5.7524700000000166]
[null,null,null,null,null,null,null,null,null,null,null,null,null,null,null,null,1047.75,9.7256424999999993,8.6010750259515572,29.099999999999898,0.39022141999998894,null,null,null,null,null,null,null,null,null,null,null,null,null,null,1047.75,9.8109999999999999,8.6279798190675017,29.099999999999898,5.7773850400000129]
[null,null,null,null,null,null,null,null,null,null,null,null,null,null,null,null,1048,9.6694600000000008,8.5448925259515569,29.1999999999999,0.41188216000000466,null,null,null,null,null,null,null,null,null,null,null,null,null,null,1048,9.7569999999999997,8.5739798190675014,29.1999999999999,5.8024063200000455]
[null,null,null,null,null,null,null,null,null,null,null,null,null,null,null,null,1048.25,9.6132775000000006,8.4887100259515567,29.299999999999901,0.43342993999999635,null,null,null,null,null,null,null,null,null,null,null,null,null,null,1048.25,9.7029999999999994,8.5199798190675011,29.299999999999901,5.827534079999964]
[null,null,null,null,null,null,null,null,null,null,null,null,null,null,null,null,1048.5,9.5570950000000003,8.4325275259515564,29.399999999999899,0.45486247999997431,null,null,null,null,null,null,null,null,null,null,null,null,null,null,1048.5,9.6489999999999991,8.4659798190675009,29.399999999999899,5.8527685599999586]
[null,null,null,null,null,null,null,null,null,null,null,null,null,null,null,null,1048.75,9.5009125000000001,8.3763450259515579,29.499999999999901,0.47617750000006254,null,null,null,null,null,null,null,null,null,null,null,null,null,null,1048.75,9.5949999999999989,8.4119798190675006,29.499999999999901,5.8781099999999924]
[null,null,null,null,null,null,null,null,null,null,null,null,null,null,null,null,1049,9.4447299999999998,8.3201625259515577,29.599999999999898,0.49737272000004396,null,null,null,null,null,null,null,null,null,null,null,null,null,null,1049,9.5410000000000004,8.3579798190675021,29.599999999999898,5.9035586400000284]
[null,null,null,null,null,null,null,null,null,null,null,null,null,null,null,null,1049.25,9.3885474999999996,8.2639800259515575,29.6999999999999,0.51844586000004256,null,null,null,null,null,null,null,null,null,null,null,null,null,null,1049.25,9.4870000000000001,8.3039798190675018,29.6999999999999,5.9291147200000296]
[null,null,null,null,null,null,null,null,null,null,null,null,null,null,null,null,1049.5,9.3323649999999994,8.2077975259515572,29.799999999999901,0.53939463999995496,null,null,null,null,null,null,null,null,null,null,null,null,null,null,1049.5,9.4329999999999998,8.2499798190675016,29.799999999999901,5.954778479999959]
[null,null,null,null,null,null,null,null,null,null,null,null,null,null,null,null,1049.75,9.2761825000000009,8.151615025951557,29.899999999999899,0.56021678000001884,null,null,null,null,null,null,null,null,null,null,null,null,null,null,1049.75,9.3789999999999996,8.1959798190675013,29.899999999999899,5.9805501600000071]
[null,null,null,null,null,null,null,null,null,null,null,null,null,null,null,null,1050,9.2200000000000006,8.0954325259515567,29.999999999999901,0.58091000000001713,null,null,null,null,null,null,null,null,null,null,null,null,null,null,1050,9.3249999999999993,8.141979819067501,29.999999999999901,6.006430000000023]
[null,null,null,null,null,null,null,null,null,null,null,null,null,null,null,null,null,null,null,30.099999999999898,0.60147201999996014,null,null,null,null,null,null,null,null,null,null,null,null,null,null,null,null,null,30.099999999999898,6.03241823999997]
[null,null,null,null,null,null,null,null,null,null,null,null,null,null,null,null,null,null,null,30.1999999999999,0.62190055999997185,null,null,null,null,null,null,null,null,null,null,null,null,null,null,null,null,null,30.1999999999999,6.0585151200000382]
[null,null,null,null,null,null,null,null,null,null,null,null,null,null,null,null,null,null,null,30.299999999999901,0.64219334000006256,null,null,null,null,null,null,null,null,null,null,null,null,null,null,null,null,null,30.299999999999901,6.0847208799999635]
[null,null,null,null,null,null,null,null,null,null,null,null,null,null,null,null,null,null,null,30.399999999999899,0.66234808000001522,null,null,null,null,null,null,null,null,null,null,null,null,null,null,null,null,null,30.399999999999899,6.1110357600000498]
[null,null,null,null,null,null,null,null,null,null,null,null,null,null,null,null,null,null,null,30.499999999999901,0.68236250000006748,null,null,null,null,null,null,null,null,null,null,null,null,null,null,null,null,null,30.499999999999901,6.1374600000000328]
[null,null,null,null,null,null,null,null,null,null,null,null,null,null,null,null,null,null,null,30.599999999999898,0.7022343200000023,null,null,null,null,null,null,null,null,null,null,null,null,null,null,null,null,null,30.599999999999898,6.1639938399999892]
[null,null,null,null,null,null,null,null,null,null,null,null,null,null,null,null,null,null,null,30.6999999999999,0.72196126000005734,null,null,null,null,null,null,null,null,null,null,null,null,null,null,null,null,null,30.6999999999999,6.1906375199999957]
[null,null,null,null,null,null,null,null,null,null,null,null,null,null,null,null,null,null,null,30.799999999999901,0.74154104000001553,null,null,null,null,null,null,null,null,null,null,null,null,null,null,null,null,null,30.799999999999901,6.2173912800000153]
[null,null,null,null,null,null,null,null,null,null,null,null,null,null,null,null,null,null,null,30.899999999999899,0.76097138000000086,null,null,null,null,null,null,null,null,null,null,null,null,null,null,null,null,null,30.899999999999899,6.244255360000011]
[null,null,null,null,null,null,null,null,null,null,null,null,null,null,null,null,null,null,null,30.999999999999901,0.78025000000002365,null,null,null,null,null,null,null,null,null,null,null,null,null,null,null,null,null,30.999999999999901,6.2712299999999459]
[null,null,null,null,null,null,null,null,null,null,null,null,null,null,null,null,null,null,null,31.099999999999898,0.7993746199999805,null,null,null,null,null,null,null,null,null,null,null,null,null,null,null,null,null,31.099999999999898,6.2983154400000103]
[null,null,null,null,null,null,null,null,null,null,null,null,null,null,null,null,null,null,null,31.1999999999999,0.8183429599999954,null,null,null,null,null,null,null,null,null,null,null,null,null,null,null,null,null,31.1999999999999,6.3255119200000536]
[null,null,null,null,null,null,null,null,null,null,null,null,null,null,null,null,null,null,null,31.299999999999901,0.83715273999996498,null,null,null,null,null,null,null,null,null,null,null,null,null,null,null,null,null,31.299999999999901,6.3528196800000387]
[null,null,null,null,null,null,null,null,null,null,null,null,null,null,null,null,null,null,null,31.399999999999899,0.85580168000001322,null,null,null,null,null,null,null,null,null,null,null,null,null,null,null,null,null,31.399999999999899,6.3802389600000424]
[null,null,null,null,null,null,null,null,null,null,null,null,null,null,null,null,null,null,null,31.499999999999901,0.87428750000003674,null,null,null,null,null,null,null,null,null,null,null,null,null,null,null,null,null,31.499999999999901,6.4077700000000277]
[null,null,null,null,null,null,null,null,null,null,null,null,null,null,null,null,null,null,null,31.599999999999898,0.89260792000004585,null,null,null,null,null,null,null,null,null,null,null,null,null,null,null,null,null,31.599999999999898,6.4354130399999576]
[null,null,null,null,null,null,null,null,null,null,null,null,null,null,null,null,null,null,null,31.6999999999999,0.91076066000005085,null,null,null,null,null,null,null,null,null,null,null,null,null,null,null,null,null,31.6999999999999,6.4631683200000225]
[null,null,null,null,null,null,null,null,null,null,null,null,null,null,null,null,null,null,null,31.799999999999901,0.92874344000006204,null,null,null,null,null,null,null,null,null,null,null,null,null,null,null,null,null,31.799999999999901,6.491036079999958]
[null,null,null,null,null,null,null,null,null,null,null,null,null,null,null,null,null,null,null,31.899999999999899,0.94655397999997604,null,null,null,null,null,null,null,null,null,null,null,null,null,null,null,null,null,31.899999999999899,6.5190165599999546]
[null,null,null,null,null,null,null,null,null,null,null,null,null,null,null,null,null,null,null,31.999999999999901,0.96419000000003052,null,null,null,null,null,null,null,null,null,null,null,null,null,null,null,null,null,31.999999999999901,6.5471099999999751]
[null,null,null,null,null,null,null,null,null,null,null,null,null,null,null,null,null,null,null,32.099999999999902,0.98164922000000843,null,null,null,null,null,null,null,null,null,null,null,null,null,null,null,null,null,32.099999999999902,6.5753166399999827]
[null,null,null,null,null,null,null,null,null,null,null,null,null,null,null,null,null,null,null,32.199999999999903,0.99892936000003374,null,null,null,null,null,null,null,null,null,null,null,null,null,null,null,null,null,32.199999999999903,6.6036367200000541]
[null,null,null,null,null,null,null,null,null,null,null,null,null,null,null,null,null,null,null,32.299999999999898,1.0160281400000031,null,null,null,null,null,null,null,null,null,null,null,null,null,null,null,null,null,32.299999999999898,6.6320704800000385]
[null,null,null,null,null,null,null,null,null,null,null,null,null,null,null,null,null,null,null,32.399999999999899,1.0329432800000404,null,null,null,null,null,null,null,null,null,null,null,null,null,null,null,null,null,32.399999999999899,6.6606181600000127]
[null,null,null,null,null,null,null,null,null,null,null,null,null,null,null,null,null,null,null,32.499999999999901,1.0496725000000424,null,null,null,null,null,null,null,null,null,null,null,null,null,null,null,null,null,32.499999999999901,6.6892800000000534]
[null,null,null,null,null,null,null,null,null,null,null,null,null,null,null,null,null,null,null,32.599999999999902,1.0662135200000193,null,null,null,null,null,null,null,null,null,null,null,null,null,null,null,null,null,32.599999999999902,6.7180562400000099]
[null,null,null,null,null,null,null,null,null,null,null,null,null,null,null,null,null,null,null,32.699999999999903,1.0825640599999815,null,null,null,null,null,null,null,null,null,null,null,null,null,null,null,null,null,32.699999999999903,6.7469471199999589]
[null,null,null,null,null,null,null,null,null,null,null,null,null,null,null,null,null,null,null,32.799999999999898,1.0987218400000529,null,null,null,null,null,null,null,null,null,null,null,null,null,null,null,null,null,32.799999999999898,6.7759528799999771]
[null,null,null,null,null,null,null,null,null,null,null,null,null,null,null,null,null,null,null,32.899999999999899,1.1146845800000165,null,null,null,null,null,null,null,null,null,null,null,null,null,null,null,null,null,32.899999999999899,6.8050737600000275]
[null,null,null,null,null,null,null,null,null,null,null,null,null,null,null,null,null,null,null,32.999999999999901,1.1304499999999962,null,null,null,null,null,null,null,null,null,null,null,null,null,null,null,null,null,32.999999999999901,6.8343099999999595]
[null,null,null,null,null,null,null,null,null,null,null,null,null,null,null,null,null,null,null,33.099999999999902,1.1460158200000023,null,null,null,null,null,null,null,null,null,null,null,null,null,null,null,null,null,33.099999999999902,6.8636618399999634]
[null,null,null,null,null,null,null,null,null,null,null,null,null,null,null,null,null,null,null,33.199999999999903,1.1613797600000453,null,null,null,null,null,null,null,null,null,null,null,null,null,null,null,null,null,33.199999999999903,6.8931295200000022]
[null,null,null,null,null,null,null,null,null,null,null,null,null,null,null,null,null,null,null,33.299999999999898,1.1765395400000216,null,null,null,null,null,null,null,null,null,null,null,null,null,null,null,null,null,33.299999999999898,6.922713280000039]
[null,null,null,null,null,null,null,null,null,null,null,null,null,null,null,null,null,null,null,33.399999999999899,1.1914928800000553,null,null,null,null,null,null,null,null,null,null,null,null,null,null,null,null,null,33.399999999999899,6.9524133600000368]
[null,null,null,null,null,null,null,null,null,null,null,null,null,null,null,null,null,null,null,33.499999999999901,1.2062375000000429,null,null,null,null,null,null,null,null,null,null,null,null,null,null,null,null,null,33.499999999999901,6.9822299999999586]
[null,null,null,null,null,null,null,null,null,null,null,null,null,null,null,null,null,null,null,33.599999999999902,1.2207711199999949,null,null,null,null,null,null,null,null,null,null,null,null,null,null,null,null,null,33.599999999999902,7.0121634399999948]
[null,null,null,null,null,null,null,null,null,null,null,null,null,null,null,null,null,null,null,33.699999999999903,1.2350914600000351,null,null,null,null,null,null,null,null,null,null,null,null,null,null,null,null,null,33.699999999999903,7.0422139199999947]
[null,null,null,null,null,null,null,null,null,null,null,null,null,null,null,null,null,null,null,33.799999999999898,1.2491962400000602,null,null,null,null,null,null,null,null,null,null,null,null,null,null,null,null,null,33.799999999999898,7.072381680000035]
[null,null,null,null,null,null,null,null,null,null,null,null,null,null,null,null,null,null,null,33.899999999999899,1.2630831799999669,null,null,null,null,null,null,null,null,null,null,null,null,null,null,null,null,null,33.899999999999899,7.102666959999965]
[null,null,null,null,null,null,null,null,null,null,null,null,null,null,null,null,null,null,null,33.999999999999901,1.2767499999999927,null,null,null,null,null,null,null,null,null,null,null,null,null,null,null,null,null,33.999999999999901,7.1330699999999752]
[null,null,null,null,null,null,null,null,null,null,null,null,null,null,null,null,null,null,null,34.099999999999902,1.2901944200000344,null,null,null,null,null,null,null,null,null,null,null,null,null,null,null,null,null,34.099999999999902,7.1635910400000284]
[null,null,null,null,null,null,null,null,null,null,null,null,null,null,null,null,null,null,null,34.199999999999903,1.3034141599999884,null,null,null,null,null,null,null,null,null,null,null,null,null,null,null,null,null,34.199999999999903,7.1942303199999742]
[null,null,null,null,null,null,null,null,null,null,null,null,null,null,null,null,null,null,null,34.299999999999898,1.3164069399999789,null,null,null,null,null,null,null,null,null,null,null,null,null,null,null,null,null,34.299999999999898,7.2249880800000028]
[null,null,null,null,null,null,null,null,null,null,null,null,null,null,null,null,null,null,null,34.399999999999899,1.3291704800000161,null,null,null,null,null,null,null,null,null,null,null,null,null,null,null,null,null,34.399999999999899,7.2558645599999636]
[null,null,null,null,null,null,null,null,null,null,null,null,null,null,null,null,null,null,null,34.499999999999901,1.3417024999999967,null,null,null,null,null,null,null,null,null,null,null,null,null,null,null,null,null,34.499999999999901,7.286860000000047]
[null,null,null,null,null,null,null,null,null,null,null,null,null,null,null,null,null,null,null,34.599999999999902,1.3540007200000446,null,null,null,null,null,null,null,null,null,null,null,null,null,null,null,null,null,34.599999999999902,7.3179746399999885]
[null,null,null,null,null,null,null,null,null,null,null,null,null,null,null,null,null,null,null,34.699999999999903,1.3660628600000564,null,null,null,null,null,null,null,null,null,null,null,null,null,null,null,null,null,34.699999999999903,7.3492087199999787]
[null,null,null,null,null,null,null,null,null,null,null,null,null,null,null,null,null,null,null,34.799999999999898,1.3778866400000425,null,null,null,null,null,null,null,null,null,null,null,null,null,null,null,null,null,34.799999999999898,7.3805624799999805]
[null,null,null,null,null,null,null,null,null,null,null,null,null,null,null,null,null,null,null,34.899999999999899,1.3894697800000131,null,null,null,null,null,null,null,null,null,null,null,null,null,null,null,null,null,34.899999999999899,7.4120361600000706]
[null,null,null,null,null,null,null,null,null,null,null,null,null,null,null,null,null,null,null,34.999999999999901,1.4008099999999786,null,null,null,null,null,null,null,null,null,null,null,null,null,null,null,null,null,34.999999999999901,7.4436299999999846]