{"text_format":"1","workbook":"xlsx","n_sheets":7,"sheets":["Cadastro","CARACTERIZAÇÃO","SCS - Dispersão","HRB_SUCS","HRB_SUCS(Dados)","TABELAS","CALCULOS"],"not_rendered":{"charts":5,"images":5,"macros":1,"external_links":4,"defined_names":5,"comments":0,"pivot_tables":0},"unopened":[],"bounds":{"document_bytes":16777216,"sheet_cells":100000,"rows_first":2000,"rows_last":500,"rows_between":2000,"halvings":0,"cell_chars":16384,"cell_head_chars":4096},"cells_cut":0,"cells_raw":0,"read":"whole","date_system":"1900"}

{"sheet":"Cadastro","index":0,"n_rows":113,"n_cols":9,"rows_kept":113,"cut":false,"hidden":true,"merged":[[11,2,11,4],[19,2,19,4],[21,2,23,4],[17,2,17,4],[18,2,18,4],[12,2,12,4],[13,2,13,4],[14,2,14,4],[15,2,15,4],[16,2,16,4],[5,6,5,8],[6,6,6,8],[7,6,7,8],[8,6,8,8],[10,2,10,4],[5,2,5,4],[6,2,6,4],[7,2,7,4],[8,2,8,4],[9,2,9,4]]}
[]
[]
[]
[]
[null,"Registro:","0565",null,null,null,"Cabeçalho"]
[null,"Cliente:",{"$f":"VLOOKUP(C5,'[1]Livro de Registro'!$A:$B,2,0)","v":"Prefeitura Municipal de Nova Lima"},null,null,null,"PREFEITURA MUNICIPAL DE NOVA LIMA"]
[null,"Projeto:","PROJETO DE PAVIMENTAÇÃO",null,null,null,"PROJETO DE INFRAESTRUTURA"]
[null,"Cód. Projeto:","BELAGIO",null,null,null,"ENSAIOS GEOTÉCNICOS DE LABORATÓRIO"]
{"$rows_left_out":106}
{"sheet":"CARACTERIZAÇÃO","index":1,"n_rows":388,"n_cols":35,"rows_kept":388,"cut":false,"hidden":false,"merged":[[211,4,211,8],[122,1,122,7],[122,10,122,15],[180,16,180,18],[181,16,181,18],[182,4,182,18],[291,1,291,4],[176,7,176,9],[177,7,177,9],[177,4,177,6],[290,5,290,6],[290,15,290,16],[290,11,290,12],[289,11,289,12],[288,7,288,8],[289,7,289,8],[290,7,290,8],[288,1,288,4],[289,1,289,4],[290,1,290,4],[217,9,217,13],[185,2,185,16],[214,14,214,18],[286,13,286,14],[6,11,6,16],[8,11,8,16],[195,11,196,18],[179,4,179,6],[178,4,178,6],[176,4,176,6],[175,4,175,6],[187,9,187,16],[186,9,186,16],[188,2,188,8],[187,2,187,8],[186,2,186,8],[179,7,179,9],[180,7,180,9],[118,3,118,4],[117,3,117,4],[148,16,148,18],[149,16,149,18],[150,16,150,18],[151,16,151,18],[148,7,148,9],[117,17,117,18],[117,7,117,8],[117,9,117,10],[285,1,285,4],[286,1,286,4],[285,5,285,12],[278,8,278,12],[278,5,280,7],[258,11,259,18],[278,13,278,14],[279,13,279,14],[280,13,280,14],[277,17,277,18],[276,17,276,18],[280,17,280,18],[274,17,274,18],[284,1,284,4],[281,17,281,18],[281,15,281,16],[282,15,282,16],[284,13,284,18],[283,13,283,18],[282,13,282,14],[281,5,283,7],[282,17,282,18],[281,1,283,4],[281,8,281,12],[365,1,365,3],[364,1,364,3],[363,1,363,3],[362,1,362,3],[361,1,361,3],[364,4,364,6],[362,4,362,6],[360,4,360,6],[347,1,349,1],[347,2,347,4],[348,2,348,4],[351,2,351,4],[352,2,352,4],[354,2,354,4],[353,1,355,1],[353,2,353,4],[349,2,349,4],[350,1,352,1],[350,2,350,4],[360,1,360,3],[355,2,355,4],[287,1,287,4],[287,5,287,6],[322,1,322,18],[297,17,297,18],[290,17,290,18],[288,9,288,10],[290,9,290,10],[287,9,287,10],[287,13,287,14],[290,13,290,14],[289,13,289,14],[291,17,291,18],[288,5,288,6],[286,15,287,18],[288,13,288,14],[288,11,288,12],[291,15,291,16],[291,13,291,14],[291,9,291,10],[289,9,289,10],[291,11,291,12],[288,15,289,16],[286,9,286,10],[288,17,289,18],[287,11,287,12],[289,5,289,6],[286,11,286,12],[286,5,286,6],[113,9,114,10],[286,7,286,8],[287,7,287,8],[218,9,218,13],[149,7,149,9],[149,13,149,15],[150,13,150,15],[151,13,151,15],[152,13,152,15],[281,13,281,14],[153,13,153,15],[154,13,154,15],[175,10,175,12],[150,7,150,9],[151,7,151,9],[152,7,152,9],[153,7,153,9],[154,7,154,9],[270,2,270,9],[258,7,260,10],[105,4,105,7],[117,11,117,12],[117,13,117,14],[118,7,118,8],[118,9,118,10],[143,2,143,9],[142,2,142,9],[141,2,141,9],[130,1,130,18],[117,1,117,2],[118,13,118,14],[131,11,132,18],[108,1,108,3],[107,1,107,3],[109,9,109,13],[113,3,114,4],[116,3,116,4],[113,5,114,6],[110,1,110,3],[115,9,115,10],[115,11,115,12],[105,1,105,3],[110,9,110,13],[115,7,115,8],[104,4,104,7],[102,1,102,3],[77,2,77,9],[78,2,78,9],[81,17,81,18],[66,3,68,6],[101,4,101,7],[74,1,75,18],[100,4,100,7],[103,9,103,13],[72,17,72,18],[71,17,71,18],[70,17,70,18],[72,11,72,16],[105,14,105,18],[103,4,103,7],[49,11,49,12],[58,3,58,4],[51,5,51,6],[54,3,54,4],[51,1,51,2],[115,13,115,14],[113,13,114,14],[113,7,114,8],[106,1,106,3],[106,4,106,7],[115,17,116,18],[106,9,106,13],[104,9,104,13],[112,17,112,18],[113,17,114,18],[107,4,107,7],[116,5,116,6],[115,5,115,6],[110,4,110,8],[109,1,109,3],[104,1,104,3],[103,1,103,3],[100,1,100,3],[101,1,101,3],[71,11,71,16],[66,7,68,10],[57,3,57,4],[57,9,57,10],[56,9,56,10],[58,9,58,10],[50,3,50,4],[54,9,54,10],[51,11,51,12],[50,11,50,12],[56,3,56,4],[52,1,52,2],[66,11,67,18],[55,1,55,2],[54,1,54,2],[53,5,53,6],[53,3,53,4],[57,11,57,12],[56,11,56,12],[56,1,56,2],[79,2,79,9],[101,9,101,13],[40,49,40,53],[13,2,13,9],[21,1,21,2],[22,1,22,2],[23,1,23,2],[25,1,25,2],[26,1,26,2],[27,1,27,2],[24,1,24,2],[32,32,32,33],[33,32,33,33],[28,31,30,31],[28,32,28,33],[29,32,29,33],[30,32,30,33],[31,31,33,31],[31,32,31,33],[38,31,38,47],[39,15,39,16],[39,39,40,41],[39,42,40,44],[39,45,40,47],[34,31,36,31],[39,31,39,32],[119,21,119,22],[120,21,120,22],[118,21,118,22],[63,31,63,34],[63,38,63,40],[117,21,117,22],[41,39,41,41],[42,31,42,32],[45,33,45,35],[45,36,45,38],[64,31,64,32],[64,33,64,36],[47,32,55,46],[46,42,46,44],[46,45,46,47],[45,39,45,41],[45,42,45,44],[64,41,65,47],[39,33,40,35],[39,36,40,38],[41,36,41,38],[40,31,40,32],[34,32,34,33],[35,32,35,33],[36,32,36,33],[52,5,52,6],[36,9,37,10],[41,13,41,14],[34,9,35,16],[46,33,46,35],[51,13,51,15],[50,13,50,15],[46,5,46,6],[42,17,42,18],[41,17,41,18],[40,17,40,18],[39,17,39,18],[38,17,38,18],[41,15,41,16],[43,13,43,14],[40,13,40,14],[39,13,39,14],[46,36,46,38],[45,31,45,32],[121,21,121,22],[112,21,113,25],[114,21,114,22],[115,21,115,22],[116,21,116,22],[108,4,108,18],[76,2,76,9],[115,15,116,16],[113,15,114,16],[121,23,121,25],[107,14,107,18],[112,1,112,16],[103,14,103,18],[116,11,116,12],[100,9,100,13],[104,14,104,18],[113,1,114,1],[107,9,107,13],[113,2,114,2],[110,14,110,18],[111,1,111,18],[45,3,45,4],[105,9,105,13],[41,45,41,47],[63,41,63,42],[50,1,50,2],[51,3,51,4],[53,9,53,10],[52,9,52,10],[51,9,51,10],[50,9,50,10],[49,9,49,10],[50,5,50,6],[45,45,45,47],[45,13,45,15],[45,11,45,12],[43,7,43,8],[46,9,46,10],[41,42,41,44],[41,31,41,32],[41,33,41,35],[46,39,46,41],[62,38,62,40],[43,31,43,32],[44,31,44,32],[46,31,46,32],[58,11,58,12],[53,13,53,15],[52,13,52,15],[69,17,69,18],[55,3,55,4],[55,9,55,10],[54,7,54,8],[55,13,55,15],[54,13,54,15],[53,11,53,12],[53,7,53,8],[54,5,54,6],[52,11,52,12],[52,3,52,4],[68,11,68,18],[109,4,109,8],[116,9,116,10],[102,4,102,7],[54,11,54,12],[55,11,55,12],[48,11,48,12],[47,11,47,12],[46,11,46,12],[47,13,47,15],[46,13,46,15],[109,14,109,18],[100,14,100,18],[101,14,101,18],[62,13,62,14],[102,14,102,18],[102,9,102,13],[48,3,48,4],[106,14,106,18],[82,1,99,18],[80,6,80,12],[58,5,58,6],[47,1,47,2],[46,1,46,2],[58,7,58,8],[28,17,28,18],[27,17,27,18],[26,17,26,18],[25,17,25,18],[36,15,37,16],[31,15,31,16],[30,15,30,16],[29,15,29,16],[28,15,28,16],[27,15,27,16],[34,17,35,18],[32,9,33,18],[29,9,29,10],[36,17,37,18],[31,17,31,18],[30,17,30,18],[29,17,29,18],[31,13,31,14],[30,13,30,14],[29,13,29,14],[28,13,28,14],[26,11,26,12],[25,11,25,12],[31,11,31,12],[30,11,30,12],[29,11,29,12],[28,11,28,12],[27,13,27,14],[70,11,70,16],[69,11,69,16],[49,13,49,15],[44,15,44,16],[43,15,43,16],[48,13,48,15],[65,1,65,18],[27,3,27,4],[28,3,28,8],[30,1,31,8],[30,9,30,10],[28,9,28,10],[48,1,48,2],[29,1,29,6],[44,17,44,18],[43,17,43,18],[36,1,37,8],[58,1,58,2],[57,1,57,2],[57,7,57,8],[45,1,45,2],[46,7,46,8],[45,5,45,6],[47,5,47,6],[38,11,38,12],[36,13,37,14],[53,1,53,2],[42,15,42,16],[36,11,37,12],[43,11,43,12],[49,1,49,2],[41,11,41,12],[42,11,42,12],[47,3,47,4],[49,5,49,6],[48,5,48,6],[48,9,48,10],[47,9,47,10],[46,3,46,4],[49,3,49,4],[38,13,38,14],[40,15,40,16],[38,15,38,16],[139,1,140,18],[131,3,133,6],[151,10,151,12],[149,10,149,12],[149,4,149,6],[148,4,148,6],[148,10,148,12],[152,4,152,6],[137,11,137,16],[131,7,133,10],[151,4,151,6],[150,4,150,6],[147,1,147,18],[144,2,144,9],[150,10,150,12],[145,6,145,12],[148,13,148,15],[152,10,152,12],[152,16,152,18],[153,4,153,6],[154,4,154,6],[133,11,133,18],[181,10,181,12],[38,9,38,10],[42,13,42,14],[128,1,128,6],[121,8,121,18],[121,2,121,3],[137,17,137,18],[136,17,136,18],[135,17,135,18],[134,17,134,18],[121,6,121,7],[113,11,114,12],[57,5,57,6],[56,5,56,6],[55,5,55,6],[120,1,120,7],[120,8,120,18],[118,11,118,12],[134,11,134,16],[135,11,135,16],[136,11,136,16],[181,4,181,6],[180,4,180,6],[198,11,198,16],[198,17,198,18],[195,7,197,10],[188,9,188,16],[175,16,175,18],[176,16,176,18],[177,16,177,18],[178,16,178,18],[178,7,178,9],[181,7,181,9],[179,10,179,12],[180,10,180,12],[195,3,197,6],[183,4,183,18],[180,13,180,15],[181,13,181,15],[178,10,178,12],[197,11,197,18],[191,13,191,14],[179,16,179,18],[28,1,28,2],[19,9,20,18],[23,11,24,12],[26,9,26,10],[25,9,25,10],[23,9,24,10],[175,7,175,9],[42,7,42,8],[41,7,41,8],[40,7,40,8],[39,7,39,8],[38,7,38,8],[31,9,31,10],[56,7,56,8],[55,7,55,8],[81,9,81,10],[156,1,170,18],[174,1,174,18],[127,1,127,6],[115,3,115,4],[116,7,116,8],[121,4,121,5],[118,1,118,2],[155,4,155,6],[7,17,7,18],[6,17,6,18],[8,17,8,18],[18,17,18,18],[21,17,22,18],[23,17,24,18],[26,13,26,14],[27,11,27,12],[17,6,17,12],[21,9,22,16],[19,1,20,8],[21,3,21,4],[22,3,22,4],[21,5,21,6],[22,5,22,6],[23,5,23,6],[24,5,24,6],[25,5,25,6],[26,5,26,6],[27,5,27,6],[15,2,15,9],[14,2,14,9],[23,15,24,16],[24,7,24,8],[21,7,21,8],[23,7,23,8],[23,3,23,4],[24,3,24,4],[25,3,25,4],[26,3,26,4],[26,7,26,8],[25,7,25,8],[23,13,24,14],[25,13,25,14],[211,9,211,13],[211,14,211,18],[119,13,119,14],[117,5,119,6],[153,16,153,18],[154,16,154,18],[155,16,155,18],[155,13,155,15],[116,13,116,14],[175,13,175,15],[176,13,176,15],[177,13,177,15],[178,13,178,15],[210,9,210,10],[179,13,179,15],[153,10,153,12],[155,10,155,12],[201,11,201,16],[208,2,208,9],[205,2,205,9],[210,17,210,18],[206,2,206,9],[207,2,207,9],[127,13,127,14],[29,7,29,8],[26,15,26,16],[25,15,25,16],[200,17,200,18],[44,13,44,14],[44,11,44,12],[40,11,40,12],[39,11,39,12],[58,13,58,15],[57,13,57,15],[56,13,56,15],[44,9,44,10],[43,9,43,10],[42,9,42,10],[41,9,41,10],[40,9,40,10],[154,10,154,12],[155,7,155,9],[33,7,33,8],[27,9,27,10],[176,10,176,12],[177,10,177,12],[199,11,199,16],[200,11,200,16],[387,1,387,18],[323,7,325,10],[325,11,325,18],[326,11,326,16],[326,17,326,18],[327,11,327,16],[327,17,327,18],[328,11,328,16],[328,17,328,18],[329,11,329,16],[329,17,329,18],[331,1,332,18],[333,2,333,9],[334,2,334,9],[365,4,365,6],[365,7,365,9],[365,10,365,12],[365,13,365,15],[365,16,365,18],[363,4,363,6],[363,7,363,9],[363,10,363,12],[363,13,363,15],[323,3,325,6],[358,10,359,12],[358,13,359,15],[358,1,358,3],[359,1,359,3],[364,13,364,15],[361,4,361,6],[361,7,361,9],[361,10,361,12],[361,13,361,15],[360,13,360,15],[364,7,364,9],[364,10,364,12],[360,10,360,12],[296,5,296,6],[296,1,296,4],[295,1,295,4],[295,15,295,18],[297,9,297,10],[297,15,297,16],[297,13,297,14],[297,11,297,12],[297,7,297,8],[295,11,295,12],[295,9,295,10],[296,9,296,10],[295,7,295,8],[295,5,295,6],[297,5,297,6],[297,1,297,4],[296,7,296,8],[345,2,345,4],[362,7,362,9],[360,7,360,9],[35,7,35,8],[34,7,34,8],[44,7,44,8],[209,6,209,12],[260,11,260,18],[261,11,261,16],[262,11,262,16],[262,17,262,18],[261,17,261,18],[219,4,219,18],[218,4,218,8],[258,3,260,6],[201,17,201,18],[199,17,199,18],[218,14,218,18],[215,14,215,18],[277,13,277,14],[323,11,324,18],[282,8,282,12],[283,8,283,12],[284,5,284,12],[3,7,5,10],[359,20,359,24],[336,2,336,9],[357,1,357,18],[358,4,359,6],[358,7,359,9],[335,2,335,9],[358,16,359,18],[338,1,338,18],[339,1,340,1],[339,2,339,4],[340,2,340,4],[341,1,343,1],[341,2,341,4],[342,2,342,4],[343,2,343,4],[344,1,346,1],[344,2,344,4],[194,1,194,18],[257,1,257,18],[203,1,204,18],[263,11,263,16],[264,11,264,16],[346,2,346,4],[11,1,12,18],[3,3,5,6],[22,7,22,8],[27,7,27,8],[18,9,18,10],[39,9,39,10],[119,7,119,8],[119,9,119,10],[119,11,119,12],[119,1,119,2],[119,3,119,4],[3,11,4,18],[9,11,9,16],[7,11,7,16],[9,17,9,18],[47,7,47,8],[52,7,52,8],[48,7,48,8],[49,7,49,8],[50,7,50,8],[51,7,51,8],[45,7,45,8],[32,7,32,8],[5,11,5,18],[274,2,274,3],[278,1,280,4],[279,8,279,12],[280,8,280,12],[275,1,277,4],[275,5,277,7],[216,14,216,18],[217,14,217,18],[216,9,216,13],[266,1,267,18],[271,2,271,9],[268,2,268,9],[269,2,269,9],[217,4,217,8],[216,4,216,8],[212,9,212,13],[213,9,213,13],[264,17,264,18],[263,17,263,18],[215,4,215,8],[214,4,214,8],[212,14,212,18],[213,14,213,18],[214,9,214,13],[215,9,215,13],[254,13,254,14],[213,4,213,8],[212,4,212,8],[293,5,294,6],[293,1,294,4],[292,5,292,6],[292,1,292,4],[291,5,291,6],[272,6,272,12],[285,13,285,18],[274,10,274,11],[277,15,277,16],[275,8,275,18],[276,8,276,12],[277,8,277,12],[279,17,279,18],[276,15,276,16],[278,15,278,16],[279,15,279,16],[278,17,278,18],[280,15,280,16],[276,13,276,14],[292,9,292,10],[292,7,292,8],[293,7,294,8],[294,17,294,18],[291,7,291,8],[384,13,384,14],[293,17,293,18],[292,17,292,18],[293,11,294,12],[296,13,296,14],[295,13,295,14],[293,9,294,10],[293,15,293,16],[292,15,292,16],[293,13,294,14],[292,13,292,14],[294,15,294,16],[292,11,292,12],[296,17,296,18],[296,15,296,16],[296,11,296,12],[362,10,362,12],[362,13,362,15],[361,16,361,18],[362,16,362,18],[363,16,363,18],[319,13,319,14],[364,16,364,18],[360,16,360,18]]}
[]
[]
[]
[null,null,null,null,null,null,null,"CLASSIFICAÇÃO                                                                                                                                                                 USO INTERNO",null,null,null,"PROJETO DE PAVIMENTAÇÃO"]
[]
[null,null,null,null,null,null,null,null,null,null,null,"BELAGIO"]
[null,"PREFEITURA MUNICIPAL DE NOVA LIMA",null,null,null,null,null,null,null,null,null,"Nº CLIENTE",null,null,null,null,null,"PÁGINA"]
[null,"PROJETO DE INFRAESTRUTURA",null,null,null,null,null,null,null,null,null,"-",null,null,null,null,null,"1/ 6"]
{"$rows_left_out":381}
{"sheet":"SCS - Dispersão","index":2,"n_rows":131,"n_cols":35,"rows_kept":131,"cut":false,"hidden":true,"merged":[[3,3,5,6],[3,7,5,10],[3,11,4,18],[5,11,5,18],[6,17,6,18],[7,11,7,16],[7,17,7,18],[15,2,15,9],[17,6,17,12],[18,9,18,10],[18,17,18,18],[19,1,20,8],[19,9,20,18],[8,17,8,18],[9,11,9,16],[9,17,9,18],[11,1,12,18],[13,2,13,9],[14,2,14,9],[21,1,21,2],[21,3,21,4],[21,5,21,6],[21,7,21,8],[21,9,22,16],[21,17,22,18],[22,1,22,2],[22,3,22,4],[22,5,22,6],[22,7,22,8],[23,13,24,14],[23,15,24,16],[23,17,24,18],[24,1,24,2],[24,3,24,4],[24,5,24,6],[24,7,24,8],[23,1,23,2],[23,3,23,4],[23,5,23,6],[23,7,23,8],[23,9,24,10],[23,11,24,12],[25,13,25,14],[25,15,25,16],[25,17,25,18],[26,1,26,2],[26,3,26,4],[26,5,26,6],[26,7,26,8],[26,9,26,10],[26,11,26,12],[26,13,26,14],[25,1,25,2],[25,3,25,4],[25,5,25,6],[25,7,25,8],[25,9,25,10],[25,11,25,12],[27,17,27,18],[28,1,28,2],[28,3,28,8],[28,9,28,10],[28,11,28,12],[28,13,28,14],[28,15,28,16],[28,17,28,18],[26,15,26,16],[26,17,26,18],[27,1,27,2],[27,3,27,4],[27,5,27,6],[27,7,27,8],[27,9,27,10],[27,11,27,12],[27,13,27,14],[27,15,27,16],[30,32,30,33],[31,9,31,10],[31,11,31,12],[31,13,31,14],[31,15,31,16],[31,17,31,18],[31,31,33,31],[31,32,31,33],[30,1,31,8],[30,9,30,10],[30,11,30,12],[30,13,30,14],[30,15,30,16],[30,17,30,18],[28,31,30,31],[28,32,28,33],[29,1,29,6],[29,7,29,8],[29,9,29,10],[29,11,29,12],[29,13,29,14],[29,15,29,16],[29,17,29,18],[29,32,29,33],[32,7,32,8],[32,9,33,18],[32,32,32,33],[33,7,33,8],[33,32,33,33],[34,7,34,8],[34,9,35,16],[34,17,35,18],[34,31,36,31],[34,32,34,33],[35,7,35,8],[35,32,35,33],[36,1,37,8],[36,9,37,10],[36,11,37,12],[36,13,37,14],[36,15,37,16],[36,17,37,18],[36,32,36,33],[38,31,38,47],[39,7,39,8],[39,9,39,10],[39,11,39,12],[39,13,39,14],[39,15,39,16],[39,17,39,18],[39,31,39,32],[39,33,40,35],[39,36,40,38],[38,7,38,8],[38,9,38,10],[38,11,38,12],[38,13,38,14],[38,15,38,16],[38,17,38,18],[40,49,40,53],[41,7,41,8],[41,9,41,10],[41,11,41,12],[41,13,41,14],[41,15,41,16],[41,17,41,18],[41,31,41,32],[41,33,41,35],[41,36,41,38],[39,39,40,41],[39,42,40,44],[39,45,40,47],[40,7,40,8],[40,9,40,10],[40,11,40,12],[40,13,40,14],[40,15,40,16],[40,17,40,18],[40,31,40,32],[41,39,41,41],[41,42,41,44],[41,45,41,47],[42,7,42,8],[42,9,42,10],[42,11,42,12],[42,13,42,14],[42,15,42,16],[42,17,42,18],[42,31,42,32],[45,45,45,47],[45,1,45,2],[45,3,45,4],[45,5,45,6],[45,7,45,8],[45,11,45,12],[45,13,45,15],[43,31,43,32],[44,7,44,8],[44,9,44,10],[44,11,44,12],[44,13,44,14],[44,15,44,16],[44,17,44,18],[44,31,44,32],[43,7,43,8],[43,9,43,10],[43,11,43,12],[43,13,43,14],[43,15,43,16],[43,17,43,18],[46,5,46,6],[46,7,46,8],[46,9,46,10],[46,11,46,12],[45,31,45,32],[45,33,45,35],[45,36,45,38],[45,39,45,41],[45,42,45,44],[48,3,48,4],[48,5,48,6],[48,7,48,8],[48,9,48,10],[48,11,48,12],[48,13,48,15],[46,45,46,47],[47,1,47,2],[47,3,47,4],[47,5,47,6],[47,7,47,8],[47,9,47,10],[47,11,47,12],[47,13,47,15],[47,32,55,46],[48,1,48,2],[46,13,46,15],[46,31,46,32],[46,33,46,35],[46,36,46,38],[46,39,46,41],[46,42,46,44],[46,1,46,2],[46,3,46,4],[49,13,49,15],[50,1,50,2],[50,3,50,4],[50,5,50,6],[50,7,50,8],[50,9,50,10],[50,11,50,12],[50,13,50,15],[49,1,49,2],[49,3,49,4],[49,5,49,6],[49,7,49,8],[49,9,49,10],[49,11,49,12],[51,13,51,15],[52,1,52,2],[52,3,52,4],[52,5,52,6],[52,7,52,8],[52,9,52,10],[52,11,52,12],[52,13,52,15],[51,1,51,2],[51,3,51,4],[51,5,51,6],[51,7,51,8],[51,9,51,10],[51,11,51,12],[53,13,53,15],[54,1,54,2],[54,3,54,4],[54,5,54,6],[54,7,54,8],[54,9,54,10],[54,11,54,12],[54,13,54,15],[53,1,53,2],[53,3,53,4],[53,5,53,6],[53,7,53,8],[53,9,53,10],[53,11,53,12],[55,13,55,15],[56,1,56,2],[56,3,56,4],[56,5,56,6],[56,7,56,8],[56,9,56,10],[56,11,56,12],[56,13,56,15],[55,1,55,2],[55,3,55,4],[55,5,55,6],[55,7,55,8],[55,9,55,10],[55,11,55,12],[62,38,62,40],[63,31,63,34],[63,38,63,40],[63,41,63,42],[64,31,64,32],[64,33,64,36],[64,41,65,47],[57,13,57,15],[58,1,58,2],[58,3,58,4],[58,5,58,6],[58,7,58,8],[58,9,58,10],[58,11,58,12],[58,13,58,15],[57,1,57,2],[57,3,57,4],[57,5,57,6],[57,7,57,8],[57,9,57,10],[57,11,57,12],[62,13,62,14],[70,11,70,16],[70,17,70,18],[71,11,71,16],[71,17,71,18],[72,11,72,16],[72,17,72,18],[65,1,65,18],[66,3,68,6],[66,7,68,10],[66,11,67,18],[68,11,68,18],[69,11,69,16],[69,17,69,18],[81,9,81,10],[81,17,81,18],[82,1,99,18],[100,1,100,3],[100,4,100,7],[100,9,100,13],[100,14,100,18],[74,1,75,18],[76,2,76,9],[77,2,77,9],[78,2,78,9],[79,2,79,9],[80,6,80,12],[103,1,103,3],[103,4,103,7],[103,9,103,13],[103,14,103,18],[104,1,104,3],[104,4,104,7],[104,9,104,13],[104,14,104,18],[101,1,101,3],[101,4,101,7],[101,9,101,13],[101,14,101,18],[102,1,102,3],[102,4,102,7],[102,9,102,13],[102,14,102,18],[107,1,107,3],[107,4,107,7],[107,9,107,13],[107,14,107,18],[108,1,108,3],[108,4,108,18],[105,1,105,3],[105,4,105,7],[105,9,105,13],[105,14,105,18],[106,1,106,3],[106,4,106,7],[106,9,106,13],[106,14,106,18],[127,1,127,6],[128,1,128,6],[130,1,130,18],[109,1,109,3],[109,4,109,8],[109,9,109,13],[109,14,109,18],[110,1,110,3],[110,4,110,8],[110,9,110,13],[110,14,110,18],[111,1,112,18],[113,1,114,6],[113,7,114,18]]}
[]
[]
[]
[null,null,null,null,null,null,null,"CLASSIFICAÇÃO                                                                                                                                                                 USO INTERNO",null,null,null,{"$f":"CARACTERIZAÇÃO!$L$4","v":"PROJETO DE PAVIMENTAÇÃO"}]
[]
[null,null,null,null,null,null,null,null,null,null,null,{"$f":"CARACTERIZAÇÃO!$L$6","v":"BELAGIO"}]
[null,{"$f":"CARACTERIZAÇÃO!$B$7","v":"PREFEITURA MUNICIPAL DE NOVA LIMA"},null,null,null,null,null,null,null,null,null,"Nº VALE",null,null,null,null,null,"PÁGINA"]
[null,{"$f":"CARACTERIZAÇÃO!$B$8","v":"PROJETO DE INFRAESTRUTURA"},null,null,null,null,null,null,null,null,null,{"$f":"CARACTERIZAÇÃO!$L$8","v":"-"},null,null,null,null,null,"5/ 6"]
{"$rows_left_out":124}
{"sheet":"HRB_SUCS","index":3,"n_rows":42,"n_cols":9,"rows_kept":42,"cut":false,"hidden":true,"merged":[[7,0,7,8],[0,0,0,8],[1,0,1,8],[2,0,2,8],[3,0,3,8],[4,0,4,8],[33,0,33,6],[15,0,15,8],[18,0,18,2],[18,6,18,8],[19,0,19,1],[20,6,20,7],[26,0,26,3],[26,6,26,8],[27,6,27,7],[28,6,28,7],[29,2,29,3],[29,6,29,7],[32,0,32,1],[34,0,34,1],[34,2,35,2],[34,3,34,6],[38,0,38,4],[39,0,40,0],[39,1,40,1],[39,2,40,2],[39,3,39,4]]}
[]
[]
["EXÉRCITO BRASILEIRO "]
["INSTITUTO MILITAR DE ENGENHARIA"]
["         DEPARTAMENTO DE ENGENHARIA DE FORTIFICAÇÃO E CONSTRUÇÃO"]
[]
[]
["CLASSIFICAÇÃO DE SOLOS"]
{"$rows_left_out":35}
{"sheet":"HRB_SUCS(Dados)","index":4,"n_rows":58,"n_cols":9,"rows_kept":58,"cut":false,"hidden":true,"merged":[[33,8,33,9],[29,8,29,9],[21,5,21,6],[22,5,22,6],[51,0,51,4],[25,0,25,4],[14,4,14,7],[15,4,15,7],[20,2,20,3],[16,4,16,8],[20,0,20,1],[18,5,18,6],[19,5,19,6],[20,5,20,6],[11,4,11,7],[12,4,12,7],[13,4,13,7],[7,0,7,8],[1,0,1,8],[2,0,2,8],[3,0,3,8],[4,0,4,8]]}
[]
[]
[]
[]
[]
[]
[]
["CLASSIFICAÇÃO DE SOLOS - SUCS"]
{"$rows_left_out":51}
{"sheet":"TABELAS","index":5,"n_rows":242,"n_cols":23,"rows_kept":242,"cut":false,"hidden":true,"merged":[]}
["N°","Capsula GPS",null,"Capsula CPN","Peso Cilindro G","Volume","T","Densidade A. T","Volume Cilindro P","Peso Cilindro P",null,null,"Temperatura (°C)","Viscosidade (g.s/cm²) ",null,"Energia","Cilindro","Balança","Estufa","Termômetro","Béquer/ Proveta/ Picnômetro","Laboratorista","Verificador"]
[1,11.8,null,80.16,4206,2063,15,0.99909999999999999,999,2310,null,null,11,1.2989999999999999E-5,null,"Normal","Grande","BLÇ-001","ET-001","TRM-001","001","André","DLFF"]
[2,19.760000000000002,null,81.25,4098,2055,15.1,0.99909999999999999,1000,2268.16,null,null,11.1,1.2954E-5,null,"Intermediário","Pequeno","BLÇ-002","ET-002","TRM-002","002","Antônio","ION"]
[3,18.420000000000002,null,80.89,4130,2074,15.2,0.99909999999999999,994,2340.64,null,null,11.2,1.2918000000000001E-5,null,"Modificado",null,"BLÇ-003",null,"TRM-003","003","Anthony","JGRCL"]
[4,18.739999999999998,null,80.23,4258,2072,15.3,0.99909999999999999,999,2340.1799999999998,null,null,11.3,1.2882E-5,null,"Golpes",null,"BLÇ-004",null,"TRM-005","004","Douglas"]
[5,18.64,null,80.19,4252,2056,15.4,0.99909999999999999,1002,2362.96,null,null,11.4,1.2846E-5,null,12,null,"BLÇ-005",null,"TRM-004","005","Igor"]
[6,19.2,null,81.42,4088,2062,15.5,0.999,998,2382.23,null,null,11.5,1.2809999999999999E-5,null,21,null,null,null,"TRM-007","006","Izabela"]
[7,19.07,null,94.92,4160,2067,15.6,0.999,1000,2343.8000000000002,null,null,11.6,1.2774E-5,null,26,null,null,null,"TRM-006","007","João Gustavo"]
{"$rows_left_out":235}
{"sheet":"CALCULOS","index":6,"n_rows":274,"n_cols":40,"rows_kept":274,"cut":false,"hidden":true,"merged":[[1,16,1,20],[0,25,0,27],[1,25,1,27],[0,36,0,38],[7,25,7,27],[7,28,7,30],[7,31,7,33],[2,25,2,27],[3,25,3,27],[4,25,4,27],[5,25,5,27],[1,35,1,39]]}
[null,null,null,null,null,null,null,null,null,null,null,null,null,null,null,null,"HEXA",null,null,null,null,null,null,null,null,"Peso Específico dos Grãos:",null,null,{"$f":"CARACTERIZAÇÃO!R116","v":2.8896530890268872}]
[null,null,null,null,null,null,null,null,null,null,null,null,null,null,null,null,"CLB-DNS-01 (Hexa)",null,null,null,null,null,null,null,null,"Grau de Saturação 01:",null,null,1,null,null,null,null,null,null,"CLB-DNS-02 (Água)"]
[null,null,null,null,null,null,null,null,null,null,null,null,null,null,null,null,"Leitura","a'","a''","T °C","Correção ",null,null,null,null,"Grau de Saturação 02:",null,null,0.8,null,null,null,null,null,null,"Leitura","a'","a''","T °C","Correção "]
[null,null,null,null,null,null,null,null,null,null,null,null,null,null,null,null,995,21.58015,20.455582525951556,8,-3.0860500000000002,null,null,null,null,"Grau de Saturação 03:",null,null,0.9,null,null,null,null,null,null,995,21.205000000000002,20.021979819067504,8,2.4983099999999467]
[null,null,null,null,null,null,null,null,null,null,null,null,null,null,null,null,995.25,21.523967500000001,20.399400025951557,8.1,-3.0915491800000154,null,null,null,null,"Densidade da Água:",null,null,1,null,null,null,null,null,null,995.25,21.151,19.967979819067502,8.1,2.5062318399999413]
[null,null,null,null,null,null,null,null,null,null,null,null,null,null,null,null,995.5,21.467784999999999,20.343217525951559,8.1999999999999993,-3.0966802399999551,null,null,null,null,null,null,null,null,null,null,null,null,null,null,995.5,21.097000000000001,19.913979819067503,8.1999999999999993,2.5142095200000085]
[null,null,null,null,null,null,null,null,null,null,null,null,null,null,null,null,995.75,21.411602500000001,20.287035025951557,8.3000000000000007,-3.1014454600000363,null,null,null,null,null,null,null,null,null,null,null,null,null,null,995.75,21.042999999999999,19.859979819067501,8.3000000000000007,2.5222432799999979]
[null,null,null,null,null,null,null,null,null,null,null,null,null,null,null,null,996,21.355419999999999,20.230852525951555,8.4,-3.1058471200000213,null,null,null,null,"Teor de Umidade",null,null,"Densidade seca S=100%",null,null,"Densidade seca S=80%",null,null,null,996,20.989000000000001,19.805979819067502,8.4,2.530333359999986]
{"$rows_left_out":266}